{"text_format":"1","workbook":"xlsx","n_sheets":3,"sheets":["Foglio1","Foglio2","Foglio3"],"not_rendered":{"charts":4,"images":14,"macros":1,"external_links":0,"defined_names":15,"comments":0,"pivot_tables":0},"unopened":[],"bounds":{"document_bytes":16777216,"sheet_cells":100000,"rows_first":2000,"rows_last":500,"rows_between":2000,"halvings":0,"cell_chars":16384,"cell_head_chars":4096},"cells_cut":0,"cells_raw":0,"read":"whole","date_system":"1900"}

{"sheet":"Foglio1","index":0,"n_rows":203,"n_cols":76,"rows_kept":203,"cut":false,"hidden":false,"merged":[[4,17,5,20],[119,7,119,8],[118,7,118,8],[117,7,117,8],[110,9,110,10],[117,9,117,10],[118,9,118,10],[119,9,119,10],[111,9,111,10],[112,9,112,10],[113,9,113,10],[115,7,115,8],[114,7,114,8],[111,7,111,8],[110,7,110,8],[109,7,109,8],[113,7,113,8],[112,7,112,8],[4,11,4,14],[6,11,6,14],[101,9,101,10],[7,11,7,14],[13,11,14,14],[100,7,100,8],[18,6,18,7],[5,11,5,14],[122,11,122,12],[121,11,121,12],[41,11,41,13],[10,10,10,11],[108,9,108,10],[109,9,109,10],[114,9,114,10],[115,9,115,10],[10,12,10,13],[24,11,25,12],[24,13,25,14],[103,9,103,10],[13,8,15,9],[102,9,102,10],[100,9,100,10],[108,7,108,8],[19,19,19,20],[105,9,105,10],[11,8,11,9],[107,7,107,8],[106,7,106,8],[105,7,105,8],[104,7,104,8],[103,7,103,8],[101,7,101,8],[102,7,102,8],[107,9,107,10],[106,9,106,10],[104,9,104,10],[15,11,23,14],[37,18,37,19],[23,19,23,20],[18,0,18,2],[5,0,5,2],[6,5,6,6],[6,3,6,4],[7,3,7,4],[11,5,11,6],[10,0,10,2],[7,5,7,6],[10,5,10,6],[12,3,12,4],[12,5,12,6],[11,3,11,4],[13,5,13,6],[19,3,19,4],[26,5,26,6],[19,5,19,6],[26,3,26,4],[14,5,14,6],[41,3,41,4],[32,1,32,5],[38,1,38,5],[39,3,39,4],[26,0,26,2],[71,49,71,50],[71,30,71,31],[71,32,71,33],[71,34,71,35],[71,36,71,37],[71,38,71,39],[71,40,71,41],[71,43,71,44],[71,45,71,46],[71,47,71,48],[26,19,26,20],[30,19,30,20],[20,19,20,20],[43,18,43,20],[28,16,29,18]]}
[null,null,null,null,null,null,null,null,null,null,null,null,null,null,null,null,null,null,null,null,null,null,null,null,88,1,"Lingua","General data:","Dati generali:",null,null,null,null,null,null,"ft",null,"m"]
[null,null,null,null,null,null,null,null,null,null,null,null,null,null,null,null,null,null,null,null,null,null,null,null,true,1,"Unità","Unit:","Unità di misura:",null,null,null,null,null,{"$f":"1*Y2","v":1},"lb",null,"kg"]
[null,null,null,null,null,null,null,null,null,null,null,null,null,null,null,null,null,null,null,null,null,null,null,null,true,1,null,"N. parallel elevators:","N. ascensori in parallelo:",null,null,null,null,null,{"$f":"1*Y3","v":1},"ft/s",null,"m/s",null,null,null,null,null,null,null,null,null,null,null,{"$f":"IF(Z21>75,IF(Z1=1,AZ3,AY3),0)","v":0},"Potenza non disponibile","Power not available",null,null,null,null,null,null,null," "]
[null,null,null,null,null,null,null,null,null,null,null,null,null,null,null,null,null,null,null,null,null,null,null,null,false,{"$f":"IF(M64<=14,1,IF(M64<=25,2,IF(M64<=33,3,0)))","v":1},null,"Energy cost:","Costo energia:",null,null,null,null,"kW",{"$f":"1*Y4","v":0},"HP",null,"CV",null,null,null,null,null,null,null,null,null,null,null,null,"Driver not available","Inverter non disponibile"]
[null,null,null,null,null,null,null,null,null,null,null,{"$f":"IF(Z1=1,AB60,AC60)","v":"GEFRAN recommended drive "},null,null,null,null,null,{"$f":"IF(Z1=1,AB9,AC9)","v":"Annual consumption"},null,null,null,null,null,null,null,0,null,"Elevator data:","Dati ascensore:",null,null,null,null,null,null,null,null,null,null,null,null,null," "]
[{"$f":"IF(Z1=1,AB1,AC1)","v":"General data:"},null,null,{"$f":"IF(Z1=1,AB2,AC2)","v":"Unit:"},null,null,null,null,null,null,null,"SIEIDrive ADL200",null,null,null,"SIEIDrive ADL200",null,null,null,null,null,null,null,null,null,1,null,"Hoisting height:","Corsa:",null,null,null,null,null,null,null,null,null,null,null,null,{"$f":"IF($Z$7=0,IF($Z$1=1,AQ6,AS6),AQ9)","v":"Sigle speed motor"},"Sigle speed motor",null,"Motore singola velocità",null,null,null,null,null,null,null,null,null,null,null,null,null,null,{"$f":"IF($Z$7=0,AP6,IF($Z$7=1,AP10,$BH$3))","v":"Sigle speed motor"}]
[null,null,null,{"$f":"IF(Z1=1,AB3,AC3)","v":"N. parallel elevators:"},null,1,null,null,null,null,null,{"$f":"IF(Z1=1,AB59,AC59)","v":"Used system"},null,null,null,null,null,null,null,null,null,null,null,null,6,0,"sinc/asinc","Motor type:","Tipo motore:",null,null,null,null,null,null,null,null,null,null,null,null,{"$f":"IF($Z$7=0,IF($Z$1=1,AQ7,AS7),AQ5)","v":"Dual speed motor"},"Dual speed motor",null,"Motore doppia velocità",null,null,null,null,null,null,null,null,null,null,null,null,null,null,{"$f":"IF($Z$7=0,AP7,BH3)","v":"Dual speed motor"}]
[null,null,null,{"$f":"IF(Z1=1,AB4,AC4)","v":"Energy cost:"},null,0.1,null,"€/kWh",null,null,null,"Dual speed motor",null,null,null,null,null,null,null,null,null,null,null,null,null,{"$f":"IF(OR(F20=\"3000/1500\",F20=\"1500/750\"),1,0)","v":0},"2vel","Motor type:","Regolazione:",null,null,null,"Tempo di accelerazione:","Acceleration time:",null,null,null,200,null,null,null,{"$f":"IF($Z$7=0,AQ12,AQ11)","v":"SIEIDrive AVRy + Brushless Motor"},"SIEIDrive ADL100","SIEIDrive ADL120"]
[null,null,null,null,null,null,null,null,null,null,null,null,null,null,null,null,null,null,null,null,null,null,null,null,null,1,"tri/mono","Annual consumption","Consumo annuale",null,null,null,"Rendimento impianto:","System efficency:",null,null,null,208,null,null,null,{"$f":"IF(Z9=1,IF($Z$7=0,AQ8,AQ5),AQ5)","v":"SIEIDrive ADL100"},"SIEIDrive ADL200"]
[null,null,null,null,null,null,null,null,null,null,null,"Encoder",null,null,{"$f":"IF(Z1=1,AH10,AI10)","v":"EMC filter included"},null,null,null,null,null,null,null,null,null,null,null,null,"Max weight:","Peso massimo:",null,null,null,null,"EMC filter included","filtro EMC integrato",".",null,230,null,null,null,{"$f":"IF(Z9=1,IF($Z$7=0,AQ9,AQ5),AQ5)","v":"SIEIDrive ADL200"},"SIEIDrive AGL50"]
[{"$f":"IF(Z1=1,AB5,AC5)","v":"Elevator data:"},null,null,{"$f":"IF(Z1=1,AB6,AC6)","v":"Hoisting height:"},null,40,null,{"$f":"IF(Z2=0,AJ1,AL1)","v":"m"},null,null,{"$f":"IF(Z1=1,AH11,AI11)","v":"Regenerative"},null,null,null,null,null,null,null,null,null,null,null,null,null,21,{"$f":"IF(L6=AP6,0,IF(L6=AP7,1,200))","v":200},"tipo reg","Speed:","Velocità:",null,null,null,null,"Regenerative","Rigenerativo",".",null,380,null,null,null,null,"SIEIDrive AVRy"]
[null,null,null,{"$f":"IF(Z1=1,AB10,AC10)","v":"Max weight:"},null,630,null,{"$f":"IF(Z2=0,AJ2,AL2)","v":"kg"},{"$f":"IF(Z1=1,AB20,AC20)","v":"Estimated power:"},null,null,null,null,null,null,null,null,null,null,null,null,null,null,null,null,0.9,null,"Stops:","Numero di fermate:",null,null,null,null,"Recommended drive:","Drive consigliato:",".",null,400,null,null,null,{"$f":"IF($Z$9=0,AQ13,AQ5)","v":" "},{"$f":"IF(Z1=1,AT12,AS12)","v":"SIEIDrive AVRy + Brushless Motor"},null,"SIEIDrive AVRy + Motore Brushless","SIEIDrive AVRy + Brushless Motor"]
[null,null,null,{"$f":"IF(Z1=1,AB11,AC11)","v":"Speed:"},null,0.9,null,{"$f":"IF(Z2=0,AJ3,AL3)","v":"m/s"},{"$f":"V44","v":3.4212374999999997},{"$f":"H22","v":"kW"},null,null,null,null,null,null,null,null,null,null,null,null,null,null,null,4,null,"total users:","Utenti totali:",null,null,null,null,null,null,null,null,500,null,null,null,null,"SIEIDrive ADL130",null,null,null,null,null,null,null,null,{"$f":"IF(OR(F20=BB13,F20=BB17),3000,IF(OR(F20=BB14,F20=BB18,F20=BB19),1500,IF(OR(F20=BB15,F20=BB20),1000,IF(F20=BB16,750,0))))","v":1500},null,{"$f":"IF($Z$7=1,BF13,BD13)","v":3000},null,3000,null,150]
[null,null,null,{"$f":"IF($Z$1=1,AH8,AG8)","v":"Acceleration time:"},null,1,null,"s",{"$f":"IF(Z29>0.1,IF(Z1=1,AB58,AC58),Z28)","v":" "},null,null,{"$f":"IF(Z1=1,AH12,AI12)","v":"Recommended drive:"},null,null,null,null,null,null,null,null,null,null,null,null,null,{"$f":"IF(Z2=1,F11,F11/3.28)","v":40},null,"Motor data:","Dati motore:",null,null,null,null,null,null,null,null,null,null,null,null,null,null,null,null,null,null,null,null,null,null,null,null,1500,null,1500,null,200]
[null,null,null,{"$f":"IF($Z$1=1,AH9,AG9)","v":"System efficency:"},null,90,null,"%",null,null,null,null,null,null,null,null,null,null,null,null,null,null,null,null,null,{"$f":"IF(Z2=1,F12,F12/2.2046)","v":630},null,"Power:","Potenza:",null,null,null,null,null,null,null,null,null,null,null,null,null,null,null,null,null,null,null,null,null,null,null,null,1000,null,1000,null,250]
[null,null,null,null,null,null,null,null,null,null,null,{"$f":"IF(OR(AND(Z21>75,G21>230),AND(Z21>37,G21<=230)),IF(Z1=1,AZ3,AY3),IF(L25=1,IF(Z1=1,AY4,AZ4),0))","v":0},null,null,null,null,null,null,null,null,null,null,null,null,null,{"$f":"IF(Z2=1,F13,F13/3.28)","v":0.9},null,"Voltage:","Tensione:",null,null,null,null,null,null,null,null,"parte alta",null,null,null,{"$f":"IF($Z$1=1,AQ16,AS16)","v":"Asynchronous"},"Asynchronous",null,"Asincrono",null,null,null,null,null,null,null,null,750,null,750,null,300]
[null,null,null,null,null,null,null,null,null,null,null,null,null,null,null,null,null,null,null,null,null,null,null,null,null,400,null,"Efficiency:","Rendimento:",null,null,null,null,null,null,"High",null,"Alti",null,null,null,{"$f":"IF($Z$1=1,AQ17,AS17)","v":"Synchronous"},"Synchronous",null,"Sincrono",null,null,null,null,null,null,null,null,"3000/1500",null,"3000/1500",null," "]
[null,null,null,null,null,null,null,null,null,null,null,null,null,null,null,null,null,null,null,null,null,null,null,null,null,null,null,"kg of CO2 saved:","kg di CO2 risparmiati:",null,null,null,null,null,null,null,null,null,null,null,null,null,null,null,null,null,null,null,null,null,null,null,null,"1500/750",null,"1500/750",null," "]
[{"$f":"IF(Z1=1,AB14,AC14)","v":"Motor data:"},null,null,{"$f":"IF(Z1=1,AB7,AC7)","v":"Motor type:"},null,null,{"$f":"IF(Z7=1,AP17,AP16)","v":"Asynchronous"},null,null,null,null,null,null,null,null,null,null,null,null,null,null,null,null,null,"cavo",{"$f":"Z14*F77","v":67.5},null,"Efficiency:","Rendimento:",null,null,null,null,null,null,"Medium/High",null,"Medio/Alti",null,null,null,null,null,null,null,null,null,null,null,null,null,null,null,null,null,null,null," "]
[null,null,null,{"$f":"IF(Z1=1,AB35,AC35)","v":"Nominal speed"},null,1500,null,"rpm",null,null,null,null,null,null,null,null,null,null,{"$f":"IF(Z1=1,AB37,AC37)","v":"Used system:"},{"$f":"IF(Z7=0,L124,L122)","v":1791.0845390591012},null,"kWh",null,null,null,3,null,"Estimated power:","Potenza stimata:",null,null,null,null,null,null,"Medium/low",null,"Medio/Bassi",null,null,null,{"$f":"IF($Z$1=1,AQ20,AS20)","v":"threephase"},"threephase",null,"Trifase",null,null,null,null,null,null,null,null,null,null,null,null," "]
[null,null,null,{"$f":"IF(Z1=1,AB16,AC16)","v":"Voltage:"},null,null,400,"V",null,null,null,null,null,null,null,null,null,null,{"$f":"IF(Z1=1,AB38,AC38)","v":"With GEFRAN drive:"},{"$f":"IF(Z33=0,L122,N116)","v":1756.8397845959239},null,"kWh",null,null,null,{"$f":"IF(Z3=1,G22,IF(Z2=1,G22/1.34,G22/1.168))","v":4},null,"Advanced settings","Impostazioni avanzate:",null,null,null,null,null,null,"Low",null,"Bassi",null,null,null,{"$f":"IF($Z$1=1,AQ21,AS21)","v":"singlephase"},"singlephase",null,"Monofase"]
[null,null,null,{"$f":"IF(Z1=1,AB15,AC15)","v":"Power:"},null,null,4,{"$f":"IF(Z3=1,AH4,IF(Z2=1,AL4,AJ4))","v":"kW"},null,null,null,null,null,null,null,null,null,null,null,null,null,null,null,null,null,400,null,"Statistic data:","Dati statistici:"]
[null,null,null,{"$f":"IF(Z1=1,AB17,AC17)","v":"Efficiency:"},null,89.3,"%",null,null,null,null,null,null,null,null,null,null,null,{"$f":"IF(Z1=1,AB39,AC39)","v":"Energy saving:"},null,null,null,null,null,null,{"$f":"F23/100","v":0.89300000000000002},null,"Estimated speed:","Velocità stimata:",null,null,null,null,null,null,"V (3~)"]
[null,null,null,{"$f":"IF(Z1=1,AB57,AC57)","v":"Power Factor:"},null,0.76,null,null,null,null,null,null,null,null,null,null,null,null,null,{"$f":"T20-T21","v":34.244754463177287},null,"kWh",null,null,null,null,null,"Person each loft","Persone per appartamento:",null,null,null,null,null,null,"V (1~)"]
[null,null,null,null,null,null,null,null,null,null,null,{"$f":"IF(AND(G21<200,Z7=1),1,IF(OR(AND(Z21>75,G21>230),AND(Z21>37,G21<=230)),0,IF(Z30=1,Y30,IF(Z31=1,Y31,IF(Z32=1,Y32,IF(Z33=1,Y33,IF(Z34=1,Y34,0)))))))","v":"ADL200"},null,{"$f":"BC69","v":1040},null,null,null,null,null,null,null,null,null,null,null,null,null,"Up-down each person","Salite e discese per persona:",null,null,null,null,null,null,null,null,null,null,null,null,null,"scelta"]
[null,null,null,null,null,null,null,null,null,null,null,null,null,null,null,null,null,null,{"$f":"IF(Z1=1,AB18,AC18)","v":"kg of CO2 saved:"},null,null,null,null,null,null,{"$f":"U26/100","v":0},null,"Users at the same time:","Compresenza di utenti:",null,null,null,null,null,null,null,null,null,null,null,null,null,"tipo"]
[{"$f":"IF(Z1=1,AB22,AC22)","v":"Statistic data:"},null,null,{"$f":"IF($Z$1=1,AB13,AC13)","v":"total users:"},null,100,null,null,null,null,null,null,null,null,null,null,null,null,null,{"$f":"T24*0.72","v":24.656223213487646},null,"kg",null,null,null,null,null,"Users per flats:","Distribuzione utenti per piani:",null,null,null,null,null,null,null,null,null,null,null,null,"scelta1"]
[null,null,null,{"$f":"IF(Z1=1,AB27,AC27)","v":"Users per flats:"},null,null,null,null,null,null,null,null,null,null,null,null,null,null,null,null,null,null,null,null,null," ",null,"Saving:","Risparmio:",null,null,null,null,null,null,null,null,null,null,null,null,"scelta2"]
[null,null,null,null,null,{"$f":"IF($Z$1=1,AJ17,AL17)","v":"High"},0.25,null,null,null,null,null,null,null,null,null,{"$f":"IF(Z1=1,AB28,AC28)","v":"Saving:"},null,null,null,null,null,null,null,"confronto P",{"$f":"(I13-G22)/G22","v":-0.14469062500000007},null,"1 person","1 persona"]
[null,null,null,null,null,{"$f":"IF($Z$1=1,AJ19,AL19)","v":"Medium/High"},0.25,null,null,null,null,null,null,null,null,null,null,null,null,null,null,null,null,null,"ADL200",{"$f":"IF(L6=AQ9,1,0)","v":1},null,"Interest trade:","Tasso d'interesse:"]
[null,null,null,null,null,{"$f":"IF($Z$1=1,AJ20,AL20)","v":"Medium/low"},0.2,null,null,null,null,null,null,null,null,null,null,null,null,{"$f":"T24*F8","v":3.4244754463177287},null,"€",null,null,{"$f":"IF(G21>=230,\"ADL100\",\"ADL120\")","v":"ADL100"},{"$f":"IF(OR(L6=AQ8,L6=AR8),1,0)","v":0},null,"2 persons","2 persone",null,null,null,null,null,null,null,null,null,null,null,null,null,{"$f":"IF(Z1=1,\"Energy [kWh]\",\"Energia [kWh]\")","v":"Energy [kWh]"}]
[null,null,null,null,null,{"$f":"IF($Z$1=1,AJ21,AL21)","v":"Low"},0.3,null,null,null,null,null,null,null,null,null,null,null,null,null,null,null,null,null,"AGL50",{"$f":"IF(L6=AQ10,1,0)","v":0},null,"3 persons","3 persone",null,null,null,null,null,null,null,null,null,null,null,null,null,"CO2 [kg] "]
[null,{"$f":"IF((G29+G30+G31+G32)<>1,IF(Z1=1,M58,M57),L57)","v":" "},null,null,null,null,{"$f":"SUM(G29:G32)","v":1},null,null,null,null,null,null,null,null,null,null,null,null,null,null,null,null,null,"AVRy",{"$f":"IF(OR(L6=AQ12,L6=AQ11),1,0)","v":0},null,"The estimated power and speed are only guidelines! Enter the real data","La potenza e velocità stimata sono solo indicative! Inserire dati reali",null,null,null,null,null," "]
[null,null,null,{"$f":"IF($Z$1=1,AB26,AC26)","v":"Users at the same time:"},null,null,null,null,null,null,null,null,null,null,null,null,null,null,null,null,null,null,null,null,"ADL130",{"$f":"IF(L6=AQ13,1,0)","v":0},null,"4+ persons","4+ persone",null,null,null,null,null,null,null,200,"RF 200 100R",null,{"$f":"IF(AK34=$AK$53,1,)","v":0},{"$f":"IF(AN34=1,AL34,\"\")","v":""}]
[null,null,null,null,null,null,0.4,null,null,null,null,null,null,null,null,null,null,null,null,null,null,null,null,null,null,null,null,"Nominal speed","Velocità nominale",null,null,null,null,null,null,null,300,"RF 200 68R",null,{"$f":"IF(AK35=$AK$53,1,)","v":0},{"$f":"IF(AN35=1,AL35,\"\")","v":""}]
[null,null,null,null,null,null,0.3,null,null,null,null,null,null,null,null,null,null,null,null,null,null,null,null,null,null,23,null,"Energy consumed in a year","Energia consumata in anno:",null,null,null,null,null,null,null,400,"RF 400 68R",null,0,""]
[null,null,null,null,null,null,0.2,null,null,null,null,null,null,null,null,null,null,null,null,null,null,null,null,null,null,null,null,"Used system:","Sistema attuale:",null,null,null,null,null,null,null,1040,"RFPD 750 DT 100R "," S8SY4",1,"RFPD 750 DT 100R ",{"$f":"IF(AN37=1,AM37,\"\")","v":" S8SY4"}]
[null,null,null,null,null,null,0.10000000000000002,null,{"$f":"IF(AND(Z15<300,G38<>0),M55,M56)","v":" "},null,null,null,null,null,null,null,null,null,null,null,null,null,null,null,null,null,null,"With GEFRAN drive:","Con drive GEFRAN:",null,null,null,null,null,null,null,1055,"RFPR 750 D 68R ","S8SZ3",0,"",{"$f":"IF(AN38=1,AM38,\"\")","v":""}]
[null,{"$f":"IF((G35+G36+G37+G38)<>1,IF(Z1=1,M58,M57),L57)","v":" "},null,null,null,null,{"$f":"SUM(G35:G38)","v":0.99999999999999989},null,null,null,null,null,null,null,null,null,null,null,null,null,null,null,null,null,null,{"$f":"S24/T31","v":0},null,"Energy saving:","Energia risparmiata:",null,null,null,null,null,null,null,2075,"RFPR 750 D 68R ","S8SZ3",0,"",""]
[null,null,null,null,null,null,null,null,null,null,null,null,null,null,null,null,null,null,null,null,null,null,null,null,null,null,null,"Advised GEFRAN drive:","Inverter GEFRAN consigliato:",null,null,null,null,null,null,null,2110,"RFPR 1200 D 49R","S8SZ4",0,"",""]
[null,null,null,null,null,null,null,null,null,null,null,null,null,null,null,null,null,null,null,null,null,null,null,null,null,null,null,"Initial cost:","Costo iniziale:",null,null,null,null,null,null,null,3150,"RFPR 1900 D 28R ","S8SZ5",0,"",""]
[null,null,null,null,null,null,null,null,null,null,null,null,null,null,null,null,null,null,null,null,null,null,null,null,null,null,null,"Payback period:","Periodo di rimborso investimento:",null,null,null,null,null,null,null,3185,"BRT4K0-15R4 ","S8T00G",0,"",""]
[null,null,null,null,null,null,null,null,null,null,null,null,null,null,null,null,null,null,null,null,{"$f":"IF(S44>J63,S44,J63)","v":3.4212374999999997},null,null,null,null,null,null,"month","mese",null,null,null,null,null,null,null,3220,"BRT4K0-15R4  ","S8T00G",0,"",""]
[null,null,null,null,null,null,null,null,null,null,null,null,null,null,null,null,null,null,{"$f":"Z66*Z16/F14*Z16/F15*100/1000","v":1.9318500000000003},null,null,{"$f":"IF(Z3=1,U43,IF(Z2=1,U43*1.34,U43*1.168))","v":3.4212374999999997},null,null,null,null,null,"months","mesi",null,null,null,null,null,null,null,4300,"BRT4K0-11R6  ","S8T00H",{"$f":"IF(AK44=$AK$53,1,)","v":0},"",""]
[null,null,null,null,null,null,null,null,null,null,null,null,null,null,null,null,null,null,null,null,null,null,null,null,null,null,null,"day","giorno",null,null,null,null,null,null,null,4370,"BRT4K0-11R6 ","S8T00H",0,"",""]
[null,null,null,null,null,null,null,null,null,null,null,null,null,null,null,null,null,null,null,null,null,null,null,null,null,null,null,"days","giorni",null,null,null,null,null,null,null,4450,"BRT8K0-7R7 ","S8T00I",0,"",""]
[null,null,null,null,null,null,null,null,null,null,null,null,null,null,null,null,null,null,null,null,null,null,null,null,null,null," ","1 year","1 anno",null,null,null,null,null,null,null,5550,"BRT8K0-7R7 ","S8T00I",0,"",""]
[null,null,null,null,null,null,null,null,null,null,null,null,null,null,null,null,null,null,null,null,null,null,null,null,null,null,null,"2 years","2 anni",null,null,null,null,null,null,null,5750,null,null,0,"",""]
[null,null,null,null,null,null,null,null,null,null,null,null,null,null,null,null,null,null,null,null,null,null,null,null,null,null,null,"3 years","3 anni"]
[null,null,null,null,null,null,null,null,null,null,null,null,null,null,null,null,null,null,null,null,null,null,null,null,null,null,null,"4 years","4 anni"]
[null,null,null,null,null,"giri",{"$f":"IF(F20=\"3000/1500\", 1500,IF(F20=\"1500/750\",750,F20))","v":1500},{"$f":"G51*2*PI()/60","v":157.07963267948966},null,null,null,null,null,null,null,null,null,null,null,null,null,null,null,null,null,null,null,"5 years","5 anni"]
[null,null,null,null,null,null,null,null,null,null,null,null,null,null,null,null,null,null,null,null,null,null,null,null,null,null,null,"6 years","6 anni",null,null,null,null,null,null,null,"RESISTENZA:"]
[null,null,null,null,null,null,null,null,null,null,null,null,null,null,null,null,null,null,null,null,null,null,null,null,null,null,null,"7 years","7 anni",null,null,null,null,null,null,null,{"$f":"Foglio2!L76","v":1040},{"$f":"Foglio2!M76","v":7.5},{"$f":"Foglio2!N76","v":38},{"$f":"Foglio2!O76","v":750},{"$f":"Foglio2!P76","v":100},{"$f":"IF(AP50=44,\"IP44\",\"IP20\")","v":"IP20"},{"$f":"CONCATENATE(AO34,AO35,AO36,AO37,AO38,AO39,AO40,AO41,AO42,AO43,AO44,AO45,AO46,AO47,AO48)","v":"RFPD 750 DT 100R "},{"$f":"CONCATENATE(AP37,AP38,AP39,AP40,AP41,AP42,AP43,AP44,AP45,AP46,AP47,AP48)","v":" S8SY4"}]
[null,null,null,{"$f":"AZ13","v":1500},null,null,{"$f":"D54/30*PI()","v":157.07963267948966},{"$f":"H51","v":157.07963267948966},null,null,null,null,null,null,null,null,null,null,null,null,null,null,null,null,null,null,null,"8+ years","8+ anni"]
[null,null,null,null,"potenza stimata:",null,null,null,null,null,null,null,{"$f":"IF(Z1=1,N55,O55)","v":"<Too much people"},"<Too much people","<Troppe persone",null,null,null,null,null,null,null,null,null,null,null,null,"Money save achieved by all the elevators installed","Risparmio ottenibile da tutti gli ascensori installati:"]
[null,null,null,null,"raggio equivalente:",null,{"$f":"$Z$16/(D54/60*2*PI())","v":5.7295779513082323E-3},{"$f":"$Z$16/H51","v":5.7295779513082323E-3},null,null,null,null," ",null,null,null,null,null,null,null,null,null,null,null,null,null,null,"Supply","Alimentazione"]
[null,null,null,null,"coppia",null,{"$f":"G56*($Z$15+$Z$19)*9.81/2","v":19.602246946188899},{"$f":"H56*($Z$15+$Z$19)*9.81/2","v":19.602246946188899},null,null,null," ","la somma deve essere uguale a: 100%",null,null,null,null,null,null,null,null,null,null,null,null,null,null,"Power Factor:","Fattore di potenza:"]
[null,null,null,null,"potenza",null,{"$f":"G57*G54/1000","v":3.0791137499999999},"kW","pot real",null,null,null,"Sum must be equal to: 100%",null,null,null,null,null,null,null,null,null,null,null,null,null,null,"Power too low!","potenza troppo bassa!"]
[null,null,null,null,"potenza rend",null,{"$f":"G58/0.85","v":3.6224867647058825},"kW",{"$f":"IF(Z3=1,G59,IF(Z2=1,G59*1.36,G59*1.34))","v":3.6224867647058825},null,null,null,null,null,null,null,null,null,{"$f":"R24/#REF!","v":{"$error":"#REF!"}},null,null,null,null,null,null,null,null,"Used system","Sistema attuale"]
[null,null,null,null,null,null,{"$f":"TRUNC(G59,2)","v":3.62},null,null,null,null,null,null,null,null,null,null,null,null,null,null,null,null,null,null,null,null,"GEFRAN recommended drive ","Drive GEFRAN consigliato"]
[null,null,null,null,"coppia",null,{"$f":"((Z21*Z23*1000)/G54)","v":22.740058268970007},null,{"$f":"G58*Z23","v":2.74964857875},null,null,null,{"$f":"IF(Z1=1,AB36,AC36)","v":"Energy consumed in a year"},null,null,null,null,null,{"$f":"S59*365","v":{"$error":"#REF!"}},{"$f":"INT(S61/365)","v":{"$error":"#REF!"}},{"$f":"INT((S61-(T61*365))/30)","v":{"$error":"#REF!"}},{"$f":"INT(S61-(T61*365)-(U61*30))","v":{"$error":"#REF!"}}]
[null,null,null,null,"raggio",null,{"$f":"G61/Z15","v":3.6095330585666677E-2},null,null,"pot vera"]
[null,null,null,null,"velocità",null,{"$f":"(E54/60)*G62","v":0},null,null,{"$f":"H57*H54/(90/100)/1000","v":3.4212374999999997},null,null,null,null,null,null,null,null,null,null,null,null,null,null,null,null,null,null,null,"Scelta=",null,"Inverter","I230","I400","I480","I230-400","I480","PI230","PI400","PI480","PM230","PM400","PM480"]
[null,null,null,null,null,null,null,null,null,null,null,null,{"$f":"Z21*1000/(G21*SQRT(3)*0.6)","v":9.6225044864937637},null,null,null,null,null,null,null,null,null,null,null,null,null,null,null,null,{"$f":"Z30","v":1},"ADL200",{"$f":"Foglio2!AF33","v":1040},{"$f":"Foglio2!AG33","v":12},{"$f":"Foglio2!AH33","v":11},{"$f":"Foglio2!AI33","v":10},{"$f":"Foglio2!AJ33","v":9},{"$f":"Foglio2!AK33","v":8.1},{"$f":"Foglio2!AL33","v":3.6},{"$f":"Foglio2!AM33","v":6.8},{"$f":"Foglio2!AN33","v":6.7},{"$f":"Foglio2!AO33","v":2},{"$f":"Foglio2!AP33","v":4},{"$f":"Foglio2!AQ33","v":5},{"$f":"Foglio2!AR33","v":300},{"$f":"Foglio2!AS33","v":10},{"$f":"Foglio2!AT33","v":159.19999999999999},{"$f":"Foglio2!AU33","v":331.1},{"$f":"Foglio2!AV33","v":158.69999999999999},{"$f":"Foglio2!AW33","v":5.8},{"$f":"Foglio2!AX33","v":6.27},{"$f":"Foglio2!AY33","v":13.04},{"$f":"Foglio2!AZ33","v":6.25},{"$f":"Foglio2!BA33","v":12.8},null,{"$f":"$AD64*AF64","v":1040},{"$f":"$AD64*AG64","v":12},11,10,9,8.1,3.6,6.8,6.7,2,4,5,300,10,159.19999999999999,331.1,158.69999999999999,5.8,6.27,13.04,{"$f":"$AD64*AZ64","v":6.25},12.8]
[null,null,null,null,null,null,null,"peso da spostare",null,{"$f":"(Z15+Z19)/2","v":348.75},null,null,null,"pot scegl",{"$f":"IF(Z7=0,G59,N98)","v":3.6224867647058825},null,null,null,null,null,null,null,null,null,null,null,null,null,null,{"$f":"Z31","v":0},"ADL100",{"$f":"Foglio2!AF20","v":1040},{"$f":"Foglio2!AG20","v":12},{"$f":"Foglio2!AH20","v":11},{"$f":"Foglio2!AI20","v":10},{"$f":"Foglio2!AJ20","v":9},{"$f":"Foglio2!AK20","v":8.1},{"$f":"Foglio2!AL20","v":3.6},{"$f":"Foglio2!AM20","v":6.8},{"$f":"Foglio2!AN20","v":6.7},{"$f":"Foglio2!AO20","v":2},{"$f":"Foglio2!AP20","v":4},{"$f":"Foglio2!AQ20","v":5},{"$f":"Foglio2!AR20","v":300},{"$f":"Foglio2!AS20","v":{"$error":"#VALUE!"}},{"$f":"Foglio2!AT20","v":159.19999999999999},{"$f":"Foglio2!AU20","v":331.1},{"$f":"Foglio2!AV20","v":158.69999999999999},{"$f":"Foglio2!AW20","v":5.8},{"$f":"Foglio2!AX20","v":6.27},{"$f":"Foglio2!AY20","v":13.04},{"$f":"Foglio2!AZ20","v":6.25},{"$f":"Foglio2!BA20","v":12.8},null,{"$f":"$AD65*AF65","v":0},0,0,0,0,0,0,0,0,0,0,0,0,{"$error":"#VALUE!"},0,0,0,0,0,0,0,0]
[null,null,null,null,"viaggi al giorno:",null,null,null,null,null,null,null,null,null,null,null,null,null,null,null,null,null,null,"massa totale",null,{"$f":"Z15*(1.4+1.9)+Z19","v":2146.5},null,null,null,{"$f":"Z32","v":0},"AGL50",{"$f":"Foglio2!AF43","v":2040},null,{"$f":"Foglio2!AH43","v":9},{"$f":"Foglio2!AI43","v":11},{"$f":"Foglio2!AJ43","v":10.1},null,null,{"$f":"Foglio2!AM43","v":7},{"$f":"Foglio2!AN43","v":4},null,{"$f":"Foglio2!AP43","v":17.2},null,{"$f":"Foglio2!AR43","v":500},{"$f":"Foglio2!AS43","v":8},{"$f":"Foglio2!AT43","v":130},{"$f":"Foglio2!AU43","v":221},{"$f":"Foglio2!AV43","v":176.5},{"$f":"Foglio2!AW43","v":3},{"$f":"Foglio2!AX43","v":5.13},{"$f":"Foglio2!AY43","v":8.7100000000000009},{"$f":"Foglio2!AZ43","v":6.96},{"$f":"Foglio2!BA43","v":6.6},null,{"$f":"$AD66*AF66","v":0},0,0,0,0,0,0,0,0,0,0,0,0,0,0,0,0,0,0,0,0,0]
[null,null,null,null,null,null,null,null,null,null,null,null,null,null,null,null,null,null,null,null,null,null,null,null,null,null,null,null,null,{"$f":"Z33","v":0},"AVRy",{"$f":"Foglio2!AF38","v":1425},null,{"$f":"Foglio2!AH38","v":13},{"$f":"Foglio2!AI38","v":16},{"$f":"Foglio2!AJ38","v":18},{"$f":"Foglio2!AK38","v":16},{"$f":"Foglio2!AL38","v":9.6999999999999993},{"$f":"Foglio2!AM38","v":11.7},{"$f":"Foglio2!AN38","v":14},{"$f":"Foglio2!AO38","v":25},{"$f":"Foglio2!AP38","v":520},null,{"$f":"Foglio2!AR38","v":300},{"$f":"Foglio2!AS38","v":8},{"$f":"Foglio2!AT38","v":350},{"$f":"Foglio2!AU38","v":670},{"$f":"Foglio2!AV38","v":150.30000000000001},{"$f":"Foglio2!AW38","v":28.7},{"$f":"Foglio2!AX38","v":13.8},{"$f":"Foglio2!AY38","v":26.4},{"$f":"Foglio2!AZ38","v":5.9},{"$f":"Foglio2!BA38","v":63.27},null,{"$f":"$AD67*AF67","v":0},0,0,0,0,0,0,0,{"$f":"$AD67*AN67","v":0},0,0,0,0,0,0,0,0,0,0,0,0,0]
[null,null,null,null,{"$f":"F12/75","v":8.4},{"$f":"#REF!*F27*G31","v":{"$error":"#REF!"}},null,null,null,"tmax",{"$f":"Z14/Z16","v":44.444444444444443},"s",null,null,null,null,null,null,null,null,null,null,null,null,null,null,null,null,null,{"$f":"Z34","v":0},"ADL130",{"$f":"Foglio2!AF87","v":3040},{"$f":"Foglio2!AG87","v":4950},{"$f":"Foglio2!AH87","v":36},{"$f":"Foglio2!AI87","v":15},{"$f":"Foglio2!AJ87","v":4},null,null,null,null,null,null,null,null,null,{"$f":"Foglio2!AK87","v":227.8},{"$f":"Foglio2!AL87","v":307},{"$f":"Foglio2!AM87","v":178},{"$f":"Foglio2!AN87","v":10.5},{"$f":"Foglio2!AO87","v":8.9700000000000006},{"$f":"Foglio2!AP87","v":15.24},{"$f":"Foglio2!AQ87","v":7.01},{"$f":"Foglio2!AR87","v":23.15},null,{"$f":"$AD68*AF68","v":0},0,0,0,0,0,0,0,{"$f":"$AD68*AN68","v":0},0,0,0,0,0,0,0,0,0,0,0,0,0]
[null,null,null,null,null,{"$f":"F68*G33","v":{"$error":"#REF!"}},null,null,null,"tmed","peso","KW","Kw/h","Kwh/giorno",null,null,null,null,null,null,null,null,null,null,null,null,null,null,null,null,null,null,null,null,null,null,null,null,null,null,null,null,null,null,null,null,null,null,null,null,null,null,null,null,{"$f":"SUM(BC64:BC68)","v":1040},{"$f":"SUM(BD64:BD68)","v":12},11,10,9,8.1,3.6,6.8,6.7,2,4,5,300,{"$error":"#VALUE!"},159.19999999999999,331.1,158.69999999999999,5.8,6.27,13.04,6.25,12.8]
[null,null,null,null,"partenze ",{"$f":"200*(G35)","v":80},null,"1 per",{"$f":"F69*G35","v":{"$error":"#REF!"}},{"$f":"K$68/(2*3600)","v":6.1728395061728392E-3},{"$f":"$J$65-70","v":278.75},{"$f":"$Z$21*(K70/($Z$15/2))","v":3.5396825396825395},{"$f":"L70*J70","v":2.1849892220262589E-2},{"$f":"M70*I70","v":{"$error":"#REF!"}},null,null,{"$f":"IF(Z$1=1,R70,S70)","v":"1 person"},"1 person","1 persona",null,null,null,null,null,null,{"$f":"J65*Z16^2/G54^2","v":1.1448787145665957E-2}]
[null,null,null,null,null,{"$f":"(F27-F70)*G36","v":6},null,"2 per",{"$f":"F$69*G36/1.75","v":{"$error":"#REF!"}},{"$f":"K$68/(2*3600)","v":6.1728395061728392E-3},{"$f":"$J$65-140","v":208.75},{"$f":"$Z$21*(K71/($Z$15/2))","v":2.6507936507936507},{"$f":"L71*J71","v":1.6362923770331175E-2},{"$f":"M71*I71","v":{"$error":"#REF!"}},null,null,{"$f":"IF(Z$1=1,R71,S71)","v":"2 persons"},"2 persons","2 persone",null,null,null,null,null,"Jtot",{"$f":"Z70+BM98","v":2.9448787145665956E-2},null,null,null,null,null,"motori possibili"]
[null,null,null,null,null,{"$f":"(F27-F70-F71)*G37","v":2.8000000000000003},null,"3 per",{"$f":"F$69*G37/2.65","v":{"$error":"#REF!"}},{"$f":"K$68/(2*3600)","v":6.1728395061728392E-3},{"$f":"ABS($J$65-210)","v":138.75},{"$f":"$Z$21*(K72/($Z$15/2))","v":1.7619047619047619},{"$f":"L72*J72","v":1.0875955320399764E-2},{"$f":"M72*I72","v":{"$error":"#REF!"}},null,null,{"$f":"IF(Z$1=1,R72,S72)","v":"3 persons"},"3 persons","3 persone",null,null,null,null,null,null,null,null,null,null,null,"Pn",null,"Vel",null,"Eff",null,"cosfi",null,"In",null,"Cn",null,"J","Rr",null,"Rs",null,"X",null,"omega"]
[null,null,null,null,null,{"$f":"F27-F71-F72-F70","v":11.200000000000003},null,"4+ per",{"$f":"F$69*G38/3.5","v":{"$error":"#REF!"}},{"$f":"K$68/(2*3600)","v":6.1728395061728392E-3},{"$f":"IF(Z15>350,ABS($J$65-3/4*Z15),J65)","v":123.75},{"$f":"$Z$21*(K73/($Z$15/2))","v":1.5714285714285714},{"$f":"L73*J73","v":9.700176366843033E-3},{"$f":"M73*I73","v":{"$error":"#REF!"}},null,null,{"$f":"IF(Z$1=1,R73,S73)","v":"4+ persons"},"4+ persons","4+ persone",null,null,null,null,null,"Energ",{"$f":"0.5*Z71*G54^2","v":363.30984902451058},{"$f":"IF($Z$7=0,1,0)","v":1},{"$f":"IF($Z$9=1,1,0)","v":1},{"$f":"IF(F20=3000,1,0)","v":0},{"$f":"AA73*AB73*AC73","v":0},null,{"$f":"Foglio3!AD21","v":4},null,{"$f":"Foglio3!AE21","v":2860},null,{"$f":"Foglio3!AF21","v":87.7},null,{"$f":"Foglio3!AG21","v":0.93},null,{"$f":"Foglio3!AH21","v":7.1},null,{"$f":"Foglio3!AI21","v":13.4},{"$f":"Foglio3!AJ21","v":1.2E-2},null,{"$f":"Foglio3!AK21","v":5.3210010824753065},null,{"$f":"Foglio3!AL21","v":3.4003343891023139},null,{"$f":"Foglio3!AM21","v":14.990222347563492},null,{"$f":"3000*PI()/30","v":314.15926535897933},null,{"$f":"$AD73*AF73","v":0},null,{"$f":"$AD73*AH73","v":0},null,{"$f":"$AD73*AJ73","v":0},null,{"$f":"$AD73*AL73","v":0},null,{"$f":"$AD73*AN73","v":0},null,{"$f":"$AD73*AP73","v":0},null,{"$f":"$AD73*AQ73","v":0},{"$f":"$AD73*AS73","v":0},null,{"$f":"$AD73*AU73","v":0},null,{"$f":"$AD73*AW73","v":0},null,{"$f":"$AD73*AY73","v":0},{"$f":"$AD73*AX73","v":0}]
[null,null,null,null,null,null,null,"0 per",{"$f":"SUM(I70:I73)/2","v":{"$error":"#REF!"}},{"$f":"K$68/(2*3600)","v":6.1728395061728392E-3},{"$f":"$J$65","v":348.75},{"$f":"$Z$21*(K74/($Z$15/2))","v":4.4285714285714288},{"$f":"L74*J74","v":2.7336860670194002E-2},{"$f":"M74*I74","v":{"$error":"#REF!"}},null,null,null,null,null,null,null,null,null,null,null,null,{"$f":"IF($Z$7=0,1,0)","v":1},{"$f":"IF($Z$9=1,1,0)","v":1},{"$f":"IF($F$20=1500,1,0)","v":1},{"$f":"AA74*AB74*AC74","v":1},null,{"$f":"Foglio3!AD39","v":4},null,{"$f":"Foglio3!AE39","v":1455},null,{"$f":"Foglio3!AF39","v":89.3},null,{"$f":"Foglio3!AG39","v":0.76},null,{"$f":"Foglio3!AH39","v":8.6},null,{"$f":"Foglio3!AI39","v":26.3},{"$f":"Foglio3!AJ39","v":1.7999999999999999E-2},null,{"$f":"Foglio3!AK39","v":3.4856747992749701},null,{"$f":"Foglio3!AL39","v":2.550493755567051},null,{"$f":"Foglio3!AM39","v":11.618915997583233},null,{"$f":"1500*PI()/30","v":157.07963267948966},null,{"$f":"$AD74*AF74","v":4},null,{"$f":"$AD74*AH74","v":1455},null,{"$f":"$AD74*AJ74","v":89.3},null,{"$f":"$AD74*AL74","v":0.76},null,{"$f":"$AD74*AN74","v":8.6},null,{"$f":"$AD74*AP74","v":26.3},null,{"$f":"$AD74*AQ74","v":1.7999999999999999E-2},{"$f":"$AD74*AS74","v":3.4856747992749701},null,{"$f":"$AD74*AU74","v":2.550493755567051},null,{"$f":"$AD74*AW74","v":11.618915997583233},null,{"$f":"$AD74*AY74","v":157.07963267948966},{"$f":"$AD74*AX74","v":0}]
[null,null,null,null,null,null,null,null,null,null,null,null,null,{"$f":"SUM(N70:N74)","v":{"$error":"#REF!"}},{"$f":"N75*365","v":{"$error":"#REF!"}},null,null,null,null,null,null,null,null,null,null,null,1,{"$f":"IF($Z$9=1,1,0)","v":1},{"$f":"IF($F$20=1000,1,0)","v":0},0,null,{"$f":"Foglio3!AD61","v":4},null,{"$f":"Foglio3!AE61","v":960},null,{"$f":"Foglio3!AF61","v":85.5},null,{"$f":"Foglio3!AG61","v":0.78},null,{"$f":"Foglio3!AH61","v":8.6999999999999993},null,{"$f":"Foglio3!AI61","v":40},{"$f":"Foglio3!AJ61","v":3.7999999999999999E-2},null,{"$f":"Foglio3!AK61","v":4.5836623610465859},null,{"$f":"Foglio3!AL61","v":6.2494447875554586},null,{"$f":"Foglio3!AM61","v":14.213333609973946},null,{"$f":"1000*PI()/30","v":104.71975511965977},null,{"$f":"$AD75*AF75","v":0},null,{"$f":"$AD75*AH75","v":0},null,{"$f":"$AD75*AJ75","v":0},null,{"$f":"$AD75*AL75","v":0},null,{"$f":"$AD75*AN75","v":0},null,{"$f":"$AD75*AP75","v":0},null,{"$f":"$AD75*AQ75","v":0},{"$f":"$AD75*AS75","v":0},null,{"$f":"$AD75*AU75","v":0},null,{"$f":"$AD75*AW75","v":0},null,{"$f":"$AD75*AY75","v":0},{"$f":"$AD75*AX75","v":0}]
[null,null,null,null,null,null,null,null,{"$f":"SUM(I70:I74)","v":{"$error":"#REF!"}},{"$f":"J73*I76*365","v":{"$error":"#REF!"}},null,null,null,null,null,null,null,null,null,null,null,null,null,null,null,null,1,{"$f":"IF($Z$9=1,1,0)","v":1},{"$f":"IF($F$20=750,1,0)","v":0},0,null,{"$f":"Foglio3!AD83","v":4},null,{"$f":"Foglio3!AE83","v":715},null,{"$f":"Foglio3!AF83","v":84.1},null,{"$f":"Foglio3!AG83","v":0.69},null,{"$f":"Foglio3!AH83","v":10},null,{"$f":"Foglio3!AI83","v":54},{"$f":"Foglio3!AJ83","v":7.1999999999999995E-2},null,{"$f":"Foglio3!AK83","v":5.2815862596421557},null,{"$f":"Foglio3!AL83","v":6.707101651132894},null,{"$f":"Foglio3!AM83","v":16.871408436555306},null,{"$f":"750*PI()/30","v":78.539816339744831},null,{"$f":"$AD76*AF76","v":0},null,{"$f":"$AD76*AH76","v":0},null,{"$f":"$AD76*AJ76","v":0},null,{"$f":"$AD76*AL76","v":0},null,{"$f":"$AD76*AN76","v":0},null,{"$f":"$AD76*AP76","v":0},null,{"$f":"$AD76*AQ76","v":0},{"$f":"$AD76*AS76","v":0},null,{"$f":"$AD76*AU76","v":0},null,{"$f":"$AD76*AW76","v":0},null,{"$f":"$AD76*AY76","v":0},{"$f":"$AD76*AX76","v":0}]
[null,null,null,null,"cavo",{"$f":"1.5/560*Z15","v":1.6875},"Kg/m"]
[null,null,null,null,null,null,null,null,null,{"$f":"SUM(I70*J70,I73*J73,I71*J71,I72*J72)","v":{"$error":"#REF!"}},null,null,null,null,null,null,null,null,"AVRy - 1 - 1425 - KXL - 4",null,null,null,null,null,"J",null,1,{"$f":"NOT(IF($Z$9=1,1,0))","v":false},{"$f":"IF(F20=3000,1,0)","v":0},0,null,{"$f":"Foglio3!AD94","v":0},null,{"$f":"Foglio3!AE94","v":0},null,{"$f":"Foglio3!AF94","v":0},null,{"$f":"Foglio3!AG94","v":0},null,{"$f":"Foglio3!AH94","v":0},null,{"$f":"Foglio3!AI94","v":0},{"$f":"Foglio3!AJ94","v":0},null,{"$f":"Foglio3!AK94","v":0},null,{"$f":"Foglio3!AL94","v":0},null,{"$f":"Foglio3!AM94","v":0},null,{"$f":"3000*PI()/30","v":314.15926535897933},null,{"$f":"$AD78*AF78","v":0},null,{"$f":"$AD78*AH78","v":0},null,{"$f":"$AD78*AJ78","v":0},null,{"$f":"$AD78*AL78","v":0},null,{"$f":"$AD78*AN78","v":0},null,{"$f":"$AD78*AP78","v":0},null,{"$f":"$AD78*AQ78","v":0},{"$f":"$AD78*AS78","v":0},null,{"$f":"$AD78*AU78","v":0},null,{"$f":"$AD78*AW78","v":0},null,{"$f":"$AD78*AY78","v":0},{"$f":"$AD78*AX78","v":0}]
[null,null,null,null,null,null,null,null,null,null,null,null,null,null,null,null,null,null,"AVRy - 1 - 2545 - KXL - 4",null,null,null,"1,5 kW",null,1.6400000000000001E-2,0.52268228351501,1,{"$f":"NOT(IF($Z$9=1,1,0))","v":false},{"$f":"IF(F20=1500,1,0)","v":1},0,null,{"$f":"Foglio3!AD108","v":0},null,{"$f":"Foglio3!AE108","v":0},null,{"$f":"Foglio3!AF108","v":0},null,{"$f":"Foglio3!AG108","v":0},null,{"$f":"Foglio3!AH108","v":0},null,{"$f":"Foglio3!AI108","v":0},{"$f":"Foglio3!AJ108","v":0},null,{"$f":"Foglio3!AK108","v":0},null,{"$f":"Foglio3!AL108","v":0},null,{"$f":"Foglio3!AM108","v":0},null,{"$f":"1500*PI()/30","v":157.07963267948966},null,{"$f":"$AD79*AF79","v":0},null,{"$f":"$AD79*AH79","v":0},null,{"$f":"$AD79*AJ79","v":0},null,{"$f":"$AD79*AL79","v":0},null,{"$f":"$AD79*AN79","v":0},null,{"$f":"$AD79*AP79","v":0},null,{"$f":"$AD79*AQ79","v":0},{"$f":"$AD79*AS79","v":0},null,{"$f":"$AD79*AU79","v":0},null,{"$f":"$AD79*AW79","v":0},null,{"$f":"$AD79*AY79","v":0},{"$f":"$AD79*AX79","v":0}]
[null,null,null,null,null,null,null,null,null,null,null,null,null,null,null,null,null,null,"AVRy - 1 - 3360 - KXL - 4",null,null,null,null,null,null,null,1,{"$f":"NOT(IF($Z$9=1,1,0))","v":false},{"$f":"IF(F20=1000,1,0)","v":0},0,null,{"$f":"Foglio3!AD116","v":0},null,{"$f":"Foglio3!AE116","v":0},null,{"$f":"Foglio3!AF116","v":0},null,{"$f":"Foglio3!AG116","v":0},null,{"$f":"Foglio3!AH116","v":0},null,{"$f":"Foglio3!AI116","v":0},{"$f":"Foglio3!AJ116","v":0},null,{"$f":"Foglio3!AK116","v":0},null,{"$f":"Foglio3!AL116","v":0},null,{"$f":"Foglio3!AM116","v":0},null,{"$f":"1000*PI()/30","v":104.71975511965977},null,{"$f":"$AD80*AF80","v":0},null,{"$f":"$AD80*AH80","v":0},null,{"$f":"$AD80*AJ80","v":0},null,{"$f":"$AD80*AL80","v":0},null,{"$f":"$AD80*AN80","v":0},null,{"$f":"$AD80*AP80","v":0},null,{"$f":"$AD80*AQ80","v":0},{"$f":"$AD80*AS80","v":0},null,{"$f":"$AD80*AU80","v":0},null,{"$f":"$AD80*AW80","v":0},null,{"$f":"$AD80*AY80","v":0},{"$f":"$AD80*AX80","v":0}]
[null,null,null,"Asincrono scelta"]
[null,null,null,null,{"$f":"Foglio2!L35","v":11.7},{"$f":"Foglio2!M35","v":0},{"$f":"Foglio2!N35","v":7.5},{"$f":"Foglio2!O35","v":11},{"$f":"Foglio2!P35","v":25},"3~",{"$f":"IF(I82=1,\"1~\",0)","v":0},null,null,null,null,null,null,null,null,null,null,null,null,null,null,null,1,{"$f":"IF($Z$9=1,1,0)","v":1},{"$f":"IF($F$20=\"3000/1500\",1,0)","v":0},0,{"$f":"Foglio3!AD144","v":4},{"$f":"Foglio3!AE144","v":2.6},{"$f":"Foglio3!AF144","v":2865},{"$f":"Foglio3!AG144","v":1430},{"$f":"Foglio3!AH144","v":82},{"$f":"Foglio3!AI144","v":77},{"$f":"Foglio3!AJ144","v":0.94},{"$f":"Foglio3!AK144","v":0.76},{"$f":"Foglio3!AL144","v":7.6},{"$f":"Foglio3!AM144","v":6.5},{"$f":"Foglio3!AN144","v":13.3},{"$f":"Foglio3!AO144","v":17.399999999999999},{"$f":"Foglio3!AP144","v":1.2E-2},{"$f":"Foglio3!AQ144","v":5.1695440162179533},{"$f":"Foglio3!AR144","v":8.1955648856516223},{"$f":"Foglio3!AS144","v":18.163926173047951},{"$f":"Foglio3!AT144","v":25.015638052180371},{"$f":"Foglio3!AU144","v":9.1881585688459833},{"$f":"Foglio3!AV144","v":8.7572941689114803},{"$f":"3000*PI()/30","v":314.15926535897933},{"$f":"1500*PI()/30","v":157.07963267948966},null,{"$f":"$AD82*AE82","v":0},0,{"$f":"$AD82*AG82","v":0},0,0,0,0,0,0,0,0,0,{"$f":"$AD82*AQ82","v":0},0,0,0,0,0,0,0,0]
[null,null,null,null,{"$f":"Foglio2!L36","v":20.8},{"$f":"Foglio2!M36","v":0},{"$f":"Foglio2!N36","v":14},{"$f":"Foglio2!O36","v":17},{"$f":"Foglio2!P36","v":45},"3~",{"$f":"IF(I83=1,\"1~\",0)","v":0},null,null,null,null,null,null,null,null,null,null,null,null,null,null,null,1,{"$f":"IF($Z$9=1,1,0)","v":1},{"$f":"IF($F$20=\"1500/750\",1,0)","v":0},0,{"$f":"Foglio3!AD167","v":3.8},{"$f":"Foglio3!AE167","v":1.9},{"$f":"Foglio3!AF167","v":1450},{"$f":"Foglio3!AG167","v":730},{"$f":"Foglio3!AH167","v":82},{"$f":"Foglio3!AI167","v":70},{"$f":"Foglio3!AJ167","v":0.86},{"$f":"Foglio3!AK167","v":0.52},{"$f":"Foglio3!AL167","v":7.7},{"$f":"Foglio3!AM167","v":7.6},{"$f":"Foglio3!AN167","v":25},{"$f":"Foglio3!AO167","v":24.9},{"$f":"Foglio3!AP167","v":3.7999999999999999E-2},{"$f":"Foglio3!AQ167","v":4.0743665431525207},{"$f":"Foglio3!AR167","v":4.9088753531958087},{"$f":"Foglio3!AS167","v":18.860652197457064},{"$f":"Foglio3!AT167","v":26.3648899142182},{"$f":"Foglio3!AU167","v":10.241965967918084},{"$f":"Foglio3!AV167","v":7.7245222607526891},{"$f":"1500*PI()/30","v":157.07963267948966},{"$f":"750*PI()/30","v":78.539816339744831},null,0,0,0,0,0,0,0,0,0,0,0,0,0,0,0,0,0,0,0,0,0]
["peso persona",null,null,"Sincrono scelta",null,null,null,null,null,null,null,null,null,null,null,null,null,null,null,null,null,null,null,null,null,null,null,null,null,null,null,null,null,null,null,null,null,null,null,null,null,null,null,null,null,null,null,null,null,null,null,null,0,0,{"$f":"$AD84*AG84","v":0},0,0,0,0,0,0,0,0,0,0,0,0,0,0,0,0,{"$f":"$AD84*AX83","v":0},{"$f":"$AD84*AY83","v":0}]
[75,null,null,null,{"$f":"Foglio2!L65","v":1040},{"$f":"Foglio2!M65","v":7.5},{"$f":"Foglio2!N65","v":38},{"$f":"Foglio2!O65","v":750}]
[null,null,null,null,{"$f":"Foglio2!L66","v":0},{"$f":"Foglio2!M66","v":0},{"$f":"Foglio2!N66","v":0},{"$f":"Foglio2!O66","v":0}]
[]
[null,null,null,null,null,null,null,null,null,null,null,null,null,null,null,null,null,null,null,null,null,null,null,null,null,null,null,null,null,null,null,{"$f":"MIN(AF90:AF97)","v":5}]
[]
[null,null,null,null,null,null,null,null,null,null,null,null,null,null,null,null,null,null,null,null,null,null,null,null,null,null,{"$f":"NOT(IF($Z$7=0,1,0))","v":false},{"$f":"IF($G$21>410,0,1)","v":1},{"$f":"IF(AND($F$20>130,$F$20<160),1,0)","v":0},{"$f":"AA90*AB90*AC90","v":0},null,{"$f":"Foglio3!AD179","v":5},null,{"$f":"Foglio3!AE179","v":152},null,{"$f":"Foglio3!AF179","v":82.2},null,{"$f":"Foglio3!AG179","v":0.87},null,{"$f":"Foglio3!AH179","v":21},null,{"$f":"Foglio3!AI179","v":0},{"$f":"Foglio3!AJ179","v":1.5},null,null,null,null,null,null,null,null,null,{"$f":"$AD90*AF90","v":0},null,{"$f":"$AD90*AH90","v":0},null,{"$f":"$AD90*AJ90","v":0},null,{"$f":"$AD90*AL90","v":0},null,{"$f":"$AD90*AN90","v":0},null,{"$f":"$AD90*AP90","v":0},null,{"$f":"$AD90*AQ90","v":0},{"$f":"$AD90*AS90","v":0},null,{"$f":"$AD90*AU90","v":0},null,{"$f":"$AD90*AW90","v":0}]
[null,null,null,null,null,null,null,null,"energia in accelerazione ",null,null,null,null,null,null,null,null,null,null,null,null,null,null,null,null,null,false,{"$f":"IF($G$21>410,0,1)","v":1},{"$f":"IF(AND($F$20>190,$F$20<210),1,0)","v":0},0,null,{"$f":"Foglio3!AD185","v":16},null,{"$f":"Foglio3!AE185","v":208},null,{"$f":"Foglio3!AF185","v":89.1},null,{"$f":"Foglio3!AG185","v":0.93},null,{"$f":"Foglio3!AH185","v":31},null,{"$f":"Foglio3!AI185","v":899},{"$f":"Foglio3!AJ185","v":2.2000000000000002},null,null,null,null,null,null,null,null,null,0,null,0,null,0,null,0,null,0,null,0,null,0,0,null,0,null,0]
[null,null,null,null,null,null,null,null,"massa","J","domega","C","Ctot","Pmax",null,"energia",null,"Ctotf","Pmaxf",null,"energia",null,null,null,null,null,false,{"$f":"IF($G$21>410,0,1)","v":1},{"$f":"IF(AND($F$20>240,$F$20<260),1,0)","v":0},0,null,{"$f":"Foglio3!AD191","v":20},null,{"$f":"Foglio3!AE191","v":264},null,{"$f":"Foglio3!AF191","v":90.1},null,{"$f":"Foglio3!AG191","v":0.9},null,{"$f":"Foglio3!AH191","v":39},null,{"$f":"Foglio3!AI191","v":869},{"$f":"Foglio3!AJ191","v":2.2000000000000002},null,null,null,null,null,null,null,null,null,0,null,0,null,0,null,0,null,0,null,0,null,0,0,null,0,null,0]
[null,null,null,null,null,null,null,"vuoto",{"$f":"$Z$15*(0.4+1.9)+$Z$19","v":1516.5},{"$f":"I93*$Z$16^2/$H$51^2+$BM$98*2","v":8.5783758297928087E-2},{"$f":"$H$51/$F$14","v":157.07963267948966},{"$f":"J93*K93","v":13.474881243304667},{"$f":"$H$57+L93","v":33.077128189493564},{"$f":"M93*$H$54/(1000*$F$15/100*$F$23/100)","v":6.4647793282294916},null,{"$f":"N93*$F$14/(2*3600)","v":8.9788601780965162E-4},null,{"$f":"$H$57-L93","v":6.1273657028842319},{"$f":"R93*$H$54/1000*$F$15/$F$23","v":0.97002902408931946},null,{"$f":"S93*$F$14/(2*3600)","v":1.3472625334573881E-4},null,null,null,null,null,false,{"$f":"IF($G$21>410,0,1)","v":1},{"$f":"IF(AND($F$20>290,$F$20<310),1,0)","v":0},0,null,{"$f":"Foglio3!AD196","v":25},null,{"$f":"Foglio3!AE196","v":298},null,{"$f":"Foglio3!AF196","v":91.4},null,{"$f":"Foglio3!AG196","v":0.93},null,{"$f":"Foglio3!AH196","v":45},null,{"$f":"Foglio3!AI196","v":940},{"$f":"Foglio3!AJ196","v":2.2000000000000002},null,null,null,null,null,null,null,null,null,0,null,0,null,0,null,0,null,0,null,0,null,0,0,null,0,null,0]
[null,null,null,"spostamento in accelerazione",null,null,{"$f":"F14*Z16/2","v":0.45},null,{"$f":"$Z$15*(0.4+1.9)+$Z$19+$A$85","v":1591.5},{"$f":"I94*$Z$16^2/$H$51^2+$BM$98*2","v":8.8245863060436899E-2},157.07963267948966,13.861627755017974,33.463874701206876,6.5403672341645427,null,9.0838433807840873E-4,null,5.740619191170925,0.90880282028192849,null,{"$f":"S94*$F$14/(2*3600)","v":1.2622261392804563E-4},null,null,null,null,null,false,{"$f":"NOT(IF($G$21>410,0,1))","v":false},{"$f":"IF(AND($F$20>130,$F$20<160),1,0)","v":0},0,null,{"$f":"Foglio3!AD204","v":13},null,{"$f":"Foglio3!AE204","v":175},null,{"$f":"Foglio3!AF204","v":87.6},null,{"$f":"Foglio3!AG204","v":0.92},null,{"$f":"Foglio3!AH204","v":22},null,{"$f":"Foglio3!AI204","v":830},{"$f":"Foglio3!AJ204","v":2.2000000000000002},null,null,null,null,null,null,null,null,null,0,null,0,null,0,null,0,null,0,null,0,null,0,0,null,0,null,0]
[null,null,null,null,null,null,null,null,{"$f":"$Z$15*(0.4+1.9)+$Z$19+$A$85*2","v":1666.5},{"$f":"I95*$Z$16^2/$H$51^2+$BM$98*2","v":9.0707967822945712E-2},157.07963267948966,14.248374266731281,33.850621212920181,6.6159551400995928,null,9.1888265834716573E-4,null,5.3538726794576181,0.84757661647453753,null,{"$f":"S95*$F$14/(2*3600)","v":1.1771897451035243E-4},null,null,null,null,null,false,{"$f":"NOT(IF($G$21>410,0,1))","v":false},{"$f":"IF(AND($F$20>190,$F$20<210),1,0)","v":0},0,null,{"$f":"Foglio3!AD211","v":19},null,{"$f":"Foglio3!AE211","v":239},null,{"$f":"Foglio3!AF211","v":89.6},null,{"$f":"Foglio3!AG211","v":0.92},null,{"$f":"Foglio3!AH211","v":31},null,{"$f":"Foglio3!AI211","v":912},{"$f":"Foglio3!AJ211","v":2.2000000000000002},null,null,null,null,null,null,null,null,null,0,null,0,null,0,null,0,null,0,null,0,null,0,0,null,0,null,0]
[null,null,null,null,null,null,null,null,{"$f":"$Z$15*(0.4+1.9)+$Z$19+$A$85*3","v":1741.5},{"$f":"I96*$Z$16^2/$H$51^2+$BM$98*2","v":9.3170072585454511E-2},157.07963267948966,14.635120778444584,34.237367724633486,6.6915430460346421,null,9.2938097861592251E-4,null,4.9671261677443148,0.78635041266714722,null,{"$f":"S96*$F$14/(2*3600)","v":1.0921533509265934E-4}]
[null,null,null,null,null,null,null,null,{"$f":"$Z$15*(1.15+1.9)+$Z$19","v":1989},{"$f":"I97*$Z$16^2/$H$51^2+$BM$98*2","v":0.1012950183017336},157.07963267948966,15.911384267098496,35.513631213287397,6.9409831356203089,null,9.6402543550282063E-4,null,3.6908626790904027,0.58430394010275688,null,{"$f":"S97*$F$14/(2*3600)","v":8.115332501427179E-5},null,null,null,null,null,false,{"$f":"NOT(IF($G$21>410,0,1))","v":false},{"$f":"IF(AND($F$20>240,$F$20<310),1,0)","v":0},{"$f":"AA97*AB97*AC97","v":0},null,{"$f":"Foglio3!AD217","v":23},null,{"$f":"Foglio3!AE217","v":304},null,{"$f":"Foglio3!AF217","v":90.8},null,{"$f":"Foglio3!AG217","v":0.89},null,{"$f":"Foglio3!AH217","v":38},null,{"$f":"Foglio3!AI217","v":857},{"$f":"Foglio3!AJ217","v":2.2000000000000002},null,null,null,null,null,null,null,null,null,{"$f":"$AD97*AF97","v":0},null,{"$f":"$AD97*AH97","v":0},null,{"$f":"$AD97*AJ97","v":0},null,{"$f":"$AD97*AL97","v":0},null,{"$f":"$AD97*AN97","v":0},null,{"$f":"$AD97*AP97","v":0},null,{"$f":"$AD97*AQ97","v":0},{"$f":"$AD97*AS97","v":0},null,{"$f":"$AD97*AU97","v":0},null,{"$f":"$AD97*AW97","v":0}]
["pesi trasportato",null,null,null,null,null,null,"max",{"$f":"$Z$15*(1.4+1.9)+$Z$19","v":2146.5},{"$f":"I98*$Z$16^2/$H$51^2+2+(Z16/F14)*0","v":2.0704654383030019},157.07963267948966,325.22795052421412,344.83019747040305,67.395546541553813,null,9.360492575215807E-3,null,-305.6257035780252,-48.383892418703375,null,null,null,null,null,null,null,null,null,null,null,null,null,null,null,null,null,null,null,null,null,null,null,null,null,null,null,null,null,null,null,null,null,{"$f":"SUM(BA73:BA97)","v":4},{"$f":"SUM(BB73:BB97)","v":0},{"$f":"SUM(BC73:BC97)","v":1455},{"$f":"SUM(BD73:BD97)","v":0},{"$f":"SUM(BE73:BE97)","v":89.3},0,{"$f":"SUM(BG73:BG97)","v":0.76},0,{"$f":"SUM(BI73:BI97)","v":8.6},0,{"$f":"SUM(BK73:BK97)","v":26.3},0,1.7999999999999999E-2,{"$f":"SUM(BN73:BN97)","v":3.4856747992749701},0,{"$f":"SUM(BP73:BP97)","v":2.550493755567051},0,{"$f":"SUM(BR73:BR97)","v":11.618915997583233},0,{"$f":"SUM(BT73:BT97)","v":157.07963267948966},{"$f":"SUM(BU73:BU97)","v":0}]
[{"$f":"ABS($Z$15/2-$A$85)","v":240},1,null,"numero di persone",null,{"$f":"Z15/A85","v":8.4},null,null,null,null,null,null,null,{"$f":"(IF($Z$3=1,N98,IF($Z$2=1,N98*1.36,N98*1.34)))","v":67.395546541553813},null,null,null,null,null,null,null,null,null,null,null,"velocità",null,"pref."]
[{"$f":"ABS($Z$15/2-$A$85*2)","v":165},2,null,"distribuzione persone",null,"persone","viaggi","Energia sicura",null,"Energia avuoto",null,null,null,null,null,"Energia start","A vuoto",null,null,null,"Energia Ferm","Avuoto",null,null,null,"rad/s","s","C1","s1","C2","Carico","diff1","diff2",null,null,"t1","t2","E1","E2",null,"I1","I2","perdite joule1","joule2","tot"]
[{"$f":"ABS($Z$15/2-$A$85*3)","v":90},3,null,"alti",{"$f":"$F$27*G29","v":25},1,{"$f":"E102*G35","v":40},{"$f":"$J$63*A99/($Z$15/2)*$E$104/3600*G101","v":1.0973704761904761},null,{"$f":"G101*$J$63*$E$104/3600","v":1.44029875},null,null,{"$f":"0.72*T21","v":1264.9246449090651},null,null,{"$f":"G101*P94","v":3.6335373523136351E-2},{"$f":"$P$93*G101","v":3.5915440712386067E-2},null,null,null,{"$f":"U94*G101","v":5.0489045571218251E-3},{"$f":"$U$93*G101","v":5.3890501338295527E-3},null,null,null,{"$f":"(1-AA101)*$BT$98","v":0},1,{"$f":"3*G$21^2/($BT$98*$BR$98*($BN$98/($BR$98*AA101)+2*$BP$98/$BR$98+AA101*$BR$98/$BN$98))","v":64.581752844879219},1,{"$f":"3*G$21^2/($BU$98*$BS$98*($BO$98/($BS$98*AC101)+2*$BQ$98/$BS$98+AC101*$BS$98/$BO$98))","v":{"$error":"#DIV/0!"}},{"$f":"$G$57","v":19.602246946188899},{"$f":"AB101-AE101","v":44.97950589869032},{"$f":"AD101-AE101","v":{"$error":"#DIV/0!"}},{"$f":"IF(AF101>0,1,0)","v":1},{"$f":"IF(AG101>0,1,0)","v":{"$error":"#DIV/0!"}},{"$f":"(Z102-Z101)*$Z$71*AH101/AF101","v":1.0284249627189391E-3},{"$f":"(Z102-Z101)*$Z$71*AI101/AG101","v":{"$error":"#DIV/0!"}},{"$f":"(Z101)*AF101*AJ101/$Z$23/3600","v":0},{"$f":"Z101*AG101*AK101/$Z$23/3600","v":{"$error":"#DIV/0!"}},{"$f":"IF($Z$8=1,IF(AI101=1,AM101,AL101),AL101)","v":0},{"$f":"$G$21/SQRT($BN$98^2/AA101^2+$BR$98^2+2*$BN$98/AA101*$BP$98)*AH101","v":31.146610507246628},{"$f":"$G$21/SQRT($BO$98^2/AC101^2+$BS$98^2+2*$BO$98/AC101*$BQ$98)*AI101","v":{"$error":"#DIV/0!"}},{"$f":"AO101^2*($BP$98+$BN$98)/3600*AJ101*AH101","v":1.6728347879560413E-3},{"$f":"AP101^2*($BP$98+$BN$98)/3600*AK101*AI101","v":{"$error":"#DIV/0!"}},{"$f":"IF($Z$8=1,IF(AI101=1,AR101,AQ101),AQ101)","v":1.6728347879560413E-3}]
[{"$f":"ABS($Z$15/2-$A$85*F99*0.75)","v":157.5},"4+",null,"viaggi",{"$f":"E101*4","v":100},2,{"$f":"E102/2*$G$36","v":15},{"$f":"$J$63*A100/($Z$15/2)*$E$104/3600*G102","v":0.28291582589285719},null,{"$f":"G102*$J$63*$E$104/3600","v":0.54011203125000007},null,null,{"$f":"T20*0.72","v":1289.5808681225528},null,null,{"$f":"G102*P95","v":1.3783239875207486E-2},{"$f":"$P$93*G102","v":1.3468290267144774E-2},null,null,null,{"$f":"U95*G102","v":1.7657846176552866E-3},{"$f":"$U$93*G102","v":2.0208938001860821E-3},null,null,null,{"$f":"(1-AA102)*$BT$98","v":1.5707963267948981},0.99,65.065918191958161,0.98,{"$error":"#DIV/0!"},{"$f":"$G$57","v":19.602246946188899},{"$f":"AB102-AE102","v":45.463671245769262},{"$f":"AD102-AE102","v":{"$error":"#DIV/0!"}},1,{"$error":"#DIV/0!"},{"$f":"(Z103-Z102)*$Z$71*AH102/AF102","v":1.0174727515275519E-3},{"$f":"(Z103-Z102)*$Z$71*AI102/AG102","v":{"$error":"#DIV/0!"}},2.2602329788758942E-5,{"$error":"#DIV/0!"},{"$f":"IF($Z$8=1,IF(AI102=1,AM102,AL102),AL102)","v":2.2602329788758942E-5},31.106436116265144,{"$error":"#DIV/0!"},{"$f":"AO102^2*($BP$98+$BN$98)/3600*AJ102*AH102","v":1.6507532400194752E-3},{"$f":"AP102^2*($BP$98+$BN$98)/3600*AK102*AI102","v":{"$error":"#DIV/0!"}},{"$f":"IF($Z$8=1,IF(AI102=1,AR102,AQ102),AQ102)","v":1.6507532400194752E-3}]
[null,null,null,"alt.med",{"$f":"($Z$14/8*7)-2*G94","v":34.1},3,{"$f":"E102/3*$G$37","v":6.6666666666666679},{"$f":"$J$63*A101/($Z$15/2)*$E$104/3600*G103","v":6.8585654761904771E-2},null,{"$f":"G103*$J$63*$E$104/3600","v":0.24004979166666671},null,null,null,null,null,{"$f":"G103*P96","v":6.1958731907728179E-3},5.9859067853976784E-3,null,null,null,{"$f":"U96*G103","v":7.2810223395106241E-4},8.9817502230492556E-4,null,null,null,3.1415926535897962,0.98,65.556387308099531,0.96,{"$error":"#DIV/0!"},19.602246946188899,45.954140361910632,{"$error":"#DIV/0!"},1,{"$error":"#DIV/0!"},1.0066132520959558E-3,{"$error":"#DIV/0!"},4.520465957751787E-5,{"$error":"#DIV/0!"},4.520465957751787E-5,31.065362226092837,{"$error":"#DIV/0!"},1.6288246952765961E-3,{"$error":"#DIV/0!"},1.6288246952765961E-3]
[null,null,null,"temp.med",{"$f":"E103/$Z$16","v":37.888888888888893},"4+",{"$f":"E102/(3*$F$99/4)*$G$38","v":1.5873015873015874},{"$f":"$J$63*A102/($Z$15/2)*$E$104/3600*G104","v":2.8577356150793654E-2},null,{"$f":"G104*$J$63*$E$104/3600","v":5.7154712301587307E-2},null,null,{"$f":"F8*L122","v":175.6839784595924},null,null,{"$f":"G104*P97","v":1.5301991039727313E-3},1.4252159012851614E-3,null,null,null,{"$f":"U97*G104","v":1.2881480160995524E-4},2.1385119578688701E-4,null,null,null,4.7123889803846941,0.97,66.053249243762238,0.94,{"$error":"#DIV/0!"},19.602246946188899,46.451002297573339,{"$error":"#DIV/0!"},1,{"$error":"#DIV/0!"},9.958460396750897E-4,{"$error":"#DIV/0!"},6.7806989366276833E-5,{"$error":"#DIV/0!"},6.7806989366276833E-5,31.023360392197198,{"$error":"#DIV/0!"},1.6070475771174423E-3,{"$error":"#DIV/0!"},1.6070475771174423E-3]
[null,null,null,"medio alti",{"$f":"$F$27*G30","v":25},1,{"$f":"E106*$G$35","v":40},{"$f":"$J$63*A99/($Z$15/2)*$E$108/3600*G105","v":0.77556095238095246},null,{"$f":"G105*$J$63*$E$108/3600","v":1.01792375},null,null,{"$f":"F8*L124","v":179.10845390591012},null,null,{"$f":"G105*P94","v":3.6335373523136351E-2},3.5915440712386067E-2,null,null,null,{"$f":"U94*G105","v":5.0489045571218251E-3},5.3890501338295527E-3,null,null,null,6.2831853071795924,0.96,66.556592855489555,0.92,{"$error":"#DIV/0!"},19.602246946188899,46.954345909300656,{"$error":"#DIV/0!"},1,{"$error":"#DIV/0!"},9.8517071809138199E-4,{"$error":"#DIV/0!"},9.0409319155035714E-5,{"$error":"#DIV/0!"},9.0409319155035714E-5,30.980401025397196,{"$error":"#DIV/0!"},1.585420330864078E-3,{"$error":"#DIV/0!"},1.585420330864078E-3]
[null,null,null,"viaggi",{"$f":"E105*4","v":100},2,{"$f":"E106/2*$G$36","v":15},{"$f":"$J$63*A100/($Z$15/2)*$E$108/3600*G106","v":0.19994930803571428},null,{"$f":"G106*$J$63*$E$108/3600","v":0.38172140624999995},null,null,null,null,null,{"$f":"G106*P95","v":1.3783239875207486E-2},1.3468290267144774E-2,null,null,null,{"$f":"U95*G106","v":1.7657846176552866E-3},2.0208938001860821E-3,null,null,null,7.8539816339744899,0.95,67.066506628839548,0.9,{"$error":"#DIV/0!"},19.602246946188899,47.464259682650649,{"$error":"#DIV/0!"},1,{"$error":"#DIV/0!"},9.7458692047998699E-4,{"$error":"#DIV/0!"},1.1301164894379472E-4,{"$error":"#DIV/0!"},1.1301164894379472E-4,30.936453336585227,{"$error":"#DIV/0!"},1.5639414234091011E-3,{"$error":"#DIV/0!"},1.5639414234091011E-3]
[null,null,null,"alt.med",{"$f":"($Z$14/8*5)-2*G94","v":24.1},3,{"$f":"E106/3*$G$37","v":6.6666666666666679},{"$f":"$J$63*A101/($Z$15/2)*$E$108/3600*G107","v":4.8472559523809536E-2},null,{"$f":"G107*$J$63*$E$108/3600","v":0.16965395833333335},null,null,null,null,null,{"$f":"G107*P96","v":6.1958731907728179E-3},5.9859067853976784E-3,null,null,null,{"$f":"U96*G107","v":7.2810223395106241E-4},8.9817502230492556E-4,null,null,null,9.4247779607693882,0.94,67.583078482273038,0.88,{"$error":"#DIV/0!"},19.602246946188899,47.980831536084139,{"$error":"#DIV/0!"},1,{"$error":"#DIV/0!"},9.6409431008272271E-4,{"$error":"#DIV/0!"},1.3561397873255215E-4,{"$error":"#DIV/0!"},1.3561397873255215E-4,30.891485278370279,{"$error":"#DIV/0!"},1.5426093428624315E-3,{"$error":"#DIV/0!"},1.5426093428624315E-3]
[null,null,null,"temp.med",{"$f":"E107/$Z$16","v":26.777777777777779},"4+",{"$f":"E106/(3*$F$99/4)*$G$38","v":1.5873015873015874},{"$f":"$J$63*A102/($Z$15/2)*$E$108/3600*G108","v":2.0196899801587304E-2},null,{"$f":"G108*$J$63*$E$108/3600","v":4.0393799603174609E-2},null,null,null,null,null,{"$f":"G108*P97","v":1.5301991039727313E-3},1.4252159012851614E-3,null,null,null,{"$f":"U97*G108","v":1.2881480160995524E-4},2.1385119578688701E-4,null,null,null,10.995574287564269,0.93,68.106395550212909,0.86,{"$error":"#DIV/0!"},19.602246946188899,48.50414860402401,{"$error":"#DIV/0!"},1,{"$error":"#DIV/0!"},9.5369258111540657E-4,{"$error":"#DIV/0!"},1.5821630852131237E-4,{"$error":"#DIV/0!"},1.5821630852131237E-4,30.845463483450715,{"$error":"#DIV/0!"},1.5214225982064181E-3,{"$error":"#DIV/0!"},1.5214225982064181E-3]
[null,null,null,"medio bassi",{"$f":"$F$27*G31","v":20},1,{"$f":"E110*$G$35","v":32},{"$f":"$J$63*A99/($Z$15/2)*$E$112/3600*G109","v":0.3630011428571428},null,{"$f":"G109*$J$63*$E$112/3600","v":0.47643899999999995},null,null,null,null,null,{"$f":"G109*P94","v":2.9068298818509079E-2},2.8732352569908852E-2,null,null,null,{"$f":"U94*G109","v":4.0391236456974603E-3},4.3112401070636418E-3,null,null,null,12.566370614359167,0.92,68.636543943321556,0.84,{"$error":"#DIV/0!"},19.602246946188899,49.034296997132657,{"$error":"#DIV/0!"},1,{"$error":"#DIV/0!"},9.4338145970935205E-4,{"$error":"#DIV/0!"},1.8081863831007135E-4,{"$error":"#DIV/0!"},1.8081863831007135E-4,30.798353199511993,{"$error":"#DIV/0!"},1.5003797189587344E-3,{"$error":"#DIV/0!"},1.5003797189587344E-3]
[null,null,null,"viaggi",{"$f":"E109*4","v":80},2,{"$f":"E110/2*$G$36","v":12},{"$f":"$J$63*A100/($Z$15/2)*$E$112/3600*G110","v":9.3586232142857134E-2},null,{"$f":"G110*$J$63*$E$112/3600","v":0.17866462499999997},null,null,null,null,null,{"$f":"G110*P95","v":1.1026591900165989E-2},1.0774632213715819E-2,null,null,null,{"$f":"U95*G110","v":1.4126276941242291E-3},1.6167150401488657E-3,null,null,null,14.137166941154065,0.91,69.173608483860122,0.82,{"$error":"#DIV/0!"},19.602246946188899,49.571361537671223,{"$error":"#DIV/0!"},1,{"$error":"#DIV/0!"},9.3316070493289845E-4,{"$error":"#DIV/0!"},2.0342096809883005E-4,{"$error":"#DIV/0!"},2.0342096809883005E-4,30.750118220430966,{"$error":"#DIV/0!"},1.4794792548436045E-3,{"$error":"#DIV/0!"},1.4794792548436045E-3]
[null,null,null,"alt.med",{"$f":"($Z$14/8*3)-2*G94","v":14.1},3,{"$f":"E110/3*$G$37","v":5.3333333333333339},{"$f":"$J$63*A101/($Z$15/2)*$E$112/3600*G111","v":2.2687571428571428E-2},null,{"$f":"G111*$J$63*$E$112/3600","v":7.9406500000000005E-2},null,null,null,null,null,{"$f":"G111*P96","v":4.9566985526182539E-3},4.7887254283181429E-3,null,null,null,{"$f":"U96*G111","v":5.8248178716084988E-4},7.1854001784394034E-4,null,null,null,15.707963267948962,0.9,69.71767241379311,0.8,{"$error":"#DIV/0!"},19.602246946188899,50.115425467604211,{"$error":"#DIV/0!"},1,{"$error":"#DIV/0!"},9.230301098985818E-4,{"$error":"#DIV/0!"},2.2602329788758916E-4,{"$error":"#DIV/0!"},2.2602329788758916E-4,30.700720813553303,{"$error":"#DIV/0!"},1.4587197754706291E-3,{"$error":"#DIV/0!"},1.4587197754706291E-3]
[null,null,null,"temp.med",{"$f":"E111/$Z$16","v":15.666666666666666},"4+",{"$f":"E110/(3*$F$99/4)*$G$38","v":1.26984126984127},{"$f":"$J$63*A102/($Z$15/2)*$E$112/3600*G112","v":9.4531547619047633E-3},null,{"$f":"G112*$J$63*$E$112/3600","v":1.8906309523809527E-2},null,null,"stdby",10,null,{"$f":"G112*P97","v":1.2241592831781852E-3},1.1401727210281292E-3,null,null,null,{"$f":"U97*G112","v":1.0305184128796419E-4},1.7108095662950962E-4,null,null,null,17.27875959474386,0.89,70.268817073081451,0.78,{"$error":"#DIV/0!"},19.602246946188899,50.666570126892552,{"$error":"#DIV/0!"},1,{"$error":"#DIV/0!"},9.1298950296270958E-4,{"$error":"#DIV/0!"},2.4862562767634811E-4,{"$error":"#DIV/0!"},2.4862562767634811E-4,30.650121642794982,{"$error":"#DIV/0!"},1.4380998700214856E-3,{"$error":"#DIV/0!"},1.4380998700214856E-3]
[null,null,null,"bassi",{"$f":"$F$27*G32","v":30},1,{"$f":"E114*$G$35","v":48},{"$f":"$J$63*A99/($Z$15/2)*$E$116/3600*G113","v":0.1583302857142857},null,{"$f":"G113*$J$63*$E$116/3600","v":0.20780849999999995},null,null,null,{"$f":"N112*365*24/1000","v":87.6},null,{"$f":"G113*P94","v":4.3602448227763616E-2},4.3098528854863274E-2,null,null,null,{"$f":"G113*U94","v":6.0586854685461908E-3},6.4668601605954628E-3,null,null,null,18.849555921538759,0.88,70.827121545366793,0.76,{"$error":"#DIV/0!"},19.602246946188899,51.224874599177895,{"$error":"#DIV/0!"},1,{"$error":"#DIV/0!"},9.0303874902446896E-4,{"$error":"#DIV/0!"},2.7122795746510706E-4,{"$error":"#DIV/0!"},2.7122795746510706E-4,30.598279687301442,{"$error":"#DIV/0!"},1.4176181469443391E-3,{"$error":"#DIV/0!"},1.4176181469443391E-3]
[null,null,null,"viaggi",{"$f":"E113*4","v":120},2,{"$f":"E114/2*$G$36","v":18},{"$f":"$J$63*A100/($Z$15/2)*$E$116/3600*G114","v":4.081952678571428E-2},null,{"$f":"G114*$J$63*$E$116/3600","v":7.7928187499999996E-2},null,null,null,null,null,{"$f":"G114*P95","v":1.6539887850248982E-2},1.616194832057373E-2,null,null,null,{"$f":"G114*U95","v":2.1189415411863436E-3},2.4250725602232986E-3,null,null,null,20.420352248333657,0.87,71.392662267984747,0.74,{"$error":"#DIV/0!"},19.602246946188899,51.790415321795848,{"$error":"#DIV/0!"},1,{"$error":"#DIV/0!"},8.9317775093240728E-4,{"$error":"#DIV/0!"},2.9383028725386606E-4,{"$error":"#DIV/0!"},2.9383028725386606E-4,30.54515215538013,{"$error":"#DIV/0!"},1.397273233655879E-3,{"$error":"#DIV/0!"},1.397273233655879E-3]
[null,null,null,"alt.med",{"$f":"($Z$14/8*1)-2*G94","v":4.0999999999999996},3,{"$f":"E114/3*$G$37","v":8},{"$f":"$J$63*A101/($Z$15/2)*$E$116/3600*G115","v":9.8956428571428563E-3},null,{"$f":"G115*$J$63*$E$116/3600","v":3.4634749999999992E-2},null,null,null,null,null,{"$f":"G115*P96","v":7.43504782892738E-3},7.183088142477213E-3,null,null,null,{"$f":"G115*U96","v":8.7372268074127472E-4},1.0778100267659105E-3,null,null,null,21.991148575128555,0.86,71.965512602955187,0.72,{"$error":"#DIV/0!"},19.602246946188899,52.363265656766288,{"$error":"#DIV/0!"},1,{"$error":"#DIV/0!"},8.8340645100692874E-4,{"$error":"#DIV/0!"},3.1643261704262496E-4,{"$error":"#DIV/0!"},3.1643261704262496E-4,30.490694393402269,{"$error":"#DIV/0!"},1.377063776250955E-3,{"$error":"#DIV/0!"},1.377063776250955E-3]
[null,null,null,"temp.med",{"$f":"E115/$Z$16","v":4.5555555555555554},"4+",{"$f":"E114/(3*$F$99/4)*$G$38","v":1.9047619047619047},{"$f":"$J$63*A102/($Z$15/2)*$E$116/3600*G116","v":4.1231845238095238E-3},null,{"$f":"G116*$J$63*$E$116/3600","v":8.2463690476190458E-3},null,null,null,{"$f":"L122-L123","v":343.81200666668838},null,{"$f":"G116*P97","v":1.8362389247672773E-3},1.7102590815421936E-3,null,null,null,{"$f":"G116*U97","v":1.5457776193194625E-4},2.5662143494426437E-4,null,null,null,23.561944901923454,0.85,72.545742365279352,0.7,{"$error":"#DIV/0!"},19.602246946188899,52.943495419090453,{"$error":"#DIV/0!"},1,{"$error":"#DIV/0!"},8.7372483268826826E-4,{"$error":"#DIV/0!"},3.3903494683138396E-4,{"$error":"#DIV/0!"},3.3903494683138396E-4,30.434859789349179,{"$error":"#DIV/0!"},1.3569884392197714E-3,{"$error":"#DIV/0!"},1.3569884392197714E-3]
[null,null,null,null,null,null,null,null,null,null,null,null,null,null,null,null,null,null,null,null,null,null,null,null,null,25.132741228718352,0.84,73.13341730452477,0.68,{"$error":"#DIV/0!"},19.602246946188899,53.531170358335871,{"$error":"#DIV/0!"},1,{"$error":"#DIV/0!"},8.6413292232034302E-4,{"$error":"#DIV/0!"},3.6163727662014286E-4,{"$error":"#DIV/0!"},3.6163727662014286E-4,30.377599670655865,{"$error":"#DIV/0!"},1.3370459051726099E-3,{"$error":"#DIV/0!"},1.3370459051726099E-3]
[null,null,null,null,"tot partenze",null,{"$f":"SUM(G101:G116)*2","v":506.03174603174602},{"$f":"SUM(H101:H116)","v":3.2235257738095235},null,{"$f":"SUM(J101:K116)","v":4.9693424404761908},null,null,null,null,null,{"$f":"SUM(P101:P116)","v":0.23137874277235757},{"$f":"SUM(Q101:Q116)","v":0.22717941466485467},null,null,null,{"$f":"SUM(U101:U116)","v":3.0686424841352523E-2},{"$f":"SUM(V101:V116)","v":3.4087880608429787E-2},null,null,null,26.70353755551325,0.83,73.728598535295433,0.66,{"$error":"#DIV/0!"},19.602246946188899,54.126351589106534,{"$error":"#DIV/0!"},1,{"$error":"#DIV/0!"},8.5463079108193194E-4,{"$error":"#DIV/0!"},3.842396064089018E-4,{"$error":"#DIV/0!"},3.842396064089018E-4,30.318863195980903,{"$error":"#DIV/0!"},1.3172348745720877E-3,{"$error":"#DIV/0!"},1.3172348745720877E-3]
[null,null,null,null,null,null,null,{"$f":"H118/2","v":1.6117628869047618},null,{"$f":"J118/D121","v":2.4846712202380954},null,null,null,null,null,{"$f":"P118/2","v":0.11568937138617878},{"$f":"Q118/2","v":0.11358970733242733},null,null,null,{"$f":"U118/2","v":1.5343212420676261E-2},{"$f":"V118/2","v":1.7043940304214893E-2},null,null,null,28.274333882308149,0.82,74.33134191176471,0.64,{"$error":"#DIV/0!"},19.602246946188899,54.729094965575811,{"$error":"#DIV/0!"},1,{"$error":"#DIV/0!"},8.452185570777727E-4,{"$error":"#DIV/0!"},4.068419361976562E-4,{"$error":"#DIV/0!"},4.068419361976562E-4,30.258597240506006,{"$error":"#DIV/0!"},1.2975540654729372E-3,{"$error":"#DIV/0!"},1.2975540654729372E-3]
["numero di ascensori",null,null,{"$f":"F7","v":1},null,null,null,{"$f":"H119*365/F15*100","v":653.65939302248671},null,{"$f":"J119*365*100/F15","v":1007.6722170965609},null,null,null,null,null,{"$f":"P119*365","v":42.226620555955257},{"$f":"Q119*365","v":41.460243176335979},null,null,null,{"$f":"U119*365","v":5.6002725335468355},{"$f":"V119*365","v":6.2210382110384357},null,null,null,29.845130209103029,0.81,74.941697340986892,0.62,{"$error":"#DIV/0!"},19.602246946188899,55.339450394797993,{"$error":"#DIV/0!"},1,{"$error":"#DIV/0!"},8.3589638760353752E-4,{"$error":"#DIV/0!"},4.2944426598641851E-4,{"$error":"#DIV/0!"},4.2944426598641851E-4,30.196746274341429,{"$error":"#DIV/0!"},1.2780022132694387E-3,{"$error":"#DIV/0!"},1.2780022132694387E-3]
[null,null,null,{"$f":"2+(D120-1)","v":2},null,null,null,null,null,null,null,null,null,null,null,null,null,null,null,null,{"$f":"ABS(U120+V120)","v":11.821310744585272},null,null,null,null,31.415926535897924,0.8,75.559708029197068,0.6,{"$error":"#DIV/0!"},19.602246946188899,55.95746108300817,{"$error":"#DIV/0!"},1,{"$error":"#DIV/0!"},8.2666450159983129E-4,{"$error":"#DIV/0!"},4.5204659577517833E-4,{"$error":"#DIV/0!"},4.5204659577517833E-4,30.133252233584287,{"$error":"#DIV/0!"},1.2585780704502697E-3,{"$error":"#DIV/0!"},1.2585780704502697E-3]
[null,null,null,null,null,null,null,null,null,null,"cons",{"$f":"SUM(H120:Q120)+IF(U120>0,(U120+V120),0)","v":1756.8397845959239},null,null,null,null,null,null,null,null,null,null,null,null,null,32.986722862692822,0.79,76.185409654753002,0.57999999999999996,{"$error":"#DIV/0!"},19.602246946188899,56.583162708564103,{"$error":"#DIV/0!"},1,{"$error":"#DIV/0!"},8.17523172312451E-4,{"$error":"#DIV/0!"},4.7464892556393738E-4,{"$error":"#DIV/0!"},4.7464892556393738E-4,30.068054383545693,{"$error":"#DIV/0!"},1.2392804063612894E-3,{"$error":"#DIV/0!"},1.2392804063612894E-3]
[null,null,null,null,null,null,null,null,null,null,"recuper",{"$f":"SUM(H120:Q120)*F15*F23/10000+IF(U120<0,U121*F23/100,0)+U121*F23/100","v":1413.0277779292355},null,null,null,null,null,null,null,null,null,null,null,null,null,34.557519189487721,0.78,76.818829460762842,0.56000000000000005,{"$error":"#DIV/0!"},19.602246946188899,57.216582514573943,{"$error":"#DIV/0!"},1,{"$error":"#DIV/0!"},8.0847273017737936E-4,{"$error":"#DIV/0!"},4.9725125535269622E-4,{"$error":"#DIV/0!"},4.9725125535269622E-4,30.001089173629627,{"$error":"#DIV/0!"},1.2201080069759499E-3,{"$error":"#DIV/0!"},1.2201080069759499E-3]
[null,null,null,null,null,null,null,null,null,null,"tot",{"$f":"L122+F126","v":1791.0845390591012},null,null,null,null,null,null,null,null,null,null,null,null,null,36.128315516282619,0.77,77.459985259773177,0.54,{"$error":"#DIV/0!"},19.602246946188899,57.857738313584278,{"$error":"#DIV/0!"},1,{"$error":"#DIV/0!"},7.9951356595140343E-4,{"$error":"#DIV/0!"},5.1985358514145528E-4,{"$error":"#DIV/0!"},5.1985358514145528E-4,29.932290083311013,{"$error":"#DIV/0!"},1.201059674673647E-3,{"$error":"#DIV/0!"},1.201059674673647E-3]
[null,null,null,"Energia avviamento",null,{"$f":"AN203+AS203","v":0.1854058482305371},"W/h",null,null,null,null,null,null,null,null,null,null,null,null,null,null,null,null,null,null,37.699111843077517,0.76,78.108884342157111,0.52,{"$error":"#DIV/0!"},19.602246946188899,58.506637395968212,{"$error":"#DIV/0!"},1,{"$error":"#DIV/0!"},7.9064613411135157E-4,{"$error":"#DIV/0!"},5.4245591493021412E-4,{"$error":"#DIV/0!"},5.4245591493021412E-4,29.861587458623099,{"$error":"#DIV/0!"},1.1821342280261332E-3,{"$error":"#DIV/0!"},1.1821342280261332E-3]
[null,null,null,"tot energia avv","tot energia",{"$f":"G118*365*F125/1000","v":34.244754463177394},null,null,null,null,null,null,null,null,null,null,null,null,null,null,null,null,null,null,null,39.269908169872416,0.75,78.765522279035807,0.5,{"$error":"#DIV/0!"},19.602246946188899,59.163275332846908,{"$error":"#DIV/0!"},1,{"$error":"#DIV/0!"},7.8187095654751312E-4,{"$error":"#DIV/0!"},5.6505824471897307E-4,{"$error":"#DIV/0!"},5.6505824471897307E-4,29.788908338524148,{"$error":"#DIV/0!"},1.1633305015921636E-3,{"$error":"#DIV/0!"},1.1633305015921636E-3]
[null,null,null,null,null,null,null,null,null,null,null,null,null,null,null,null,null,null,null,null,null,null,null,null,null,40.840704496667314,0.74,79.429881609683605,0.48,{"$error":"#DIV/0!"},19.602246946188899,59.827634663494706,{"$error":"#DIV/0!"},1,{"$error":"#DIV/0!"},7.7318862657965617E-4,{"$error":"#DIV/0!"},5.8766057450773213E-4,{"$error":"#DIV/0!"},5.8766057450773213E-4,29.71417627047132,{"$error":"#DIV/0!"},1.1446473457205919E-3,{"$error":"#DIV/0!"},1.1446473457205919E-3]
[null,null,null,null,null,null,null,null,null,null,null,null,null,null,null,null,null,null,null,null,null,null,null,null,null,42.411500823462212,0.73,80.10193040239615,0.46,{"$error":"#DIV/0!"},19.602246946188899,60.499683456207251,{"$error":"#DIV/0!"},1,{"$error":"#DIV/0!"},7.6459981332730159E-4,{"$error":"#DIV/0!"},6.1026290429649107E-4,{"$error":"#DIV/0!"},6.1026290429649107E-4,29.63731111448454,{"$error":"#DIV/0!"},1.1260836263621784E-3,{"$error":"#DIV/0!"},1.1260836263621784E-3]
[null,null,null,null,null,null,null,null,null,null,null,null,null,null,null,null,null,null,null,null,null,null,null,null,null,43.982297150257111,0.72,80.781620676738669,0.44,{"$error":"#DIV/0!"},19.602246946188899,61.17937373054977,{"$error":"#DIV/0!"},1,{"$error":"#DIV/0!"},7.5610526646953987E-4,{"$error":"#DIV/0!"},6.3286523408524992E-4,{"$error":"#DIV/0!"},6.3286523408524992E-4,29.558228834935942,{"$error":"#DIV/0!"},1.107638224890412E-3,{"$error":"#DIV/0!"},1.107638224890412E-3]
[null,null,null,null,null,null,null,null,null,null,null,null,null,null,null,null,null,null,null,null,null,null,null,null,null,45.553093477052009,0.71,81.468886673926377,0.41999999999999899,{"$error":"#DIV/0!"},19.602246946188899,61.866639727737478,{"$error":"#DIV/0!"},1,{"$error":"#DIV/0!"},7.4770582143379976E-4,{"$error":"#DIV/0!"},6.5546756387400886E-4,{"$error":"#DIV/0!"},6.5546756387400886E-4,29.476841279250298,{"$error":"#DIV/0!"},1.0893100379316958E-3,{"$error":"#DIV/0!"},1.0893100379316958E-3]
[null,null,null,null,null,null,null,null,null,null,null,null,null,null,null,null,null,null,null,null,null,null,null,null,null,47.123889803846907,0.7,82.16364296081278,0.39999999999999902,{"$error":"#DIV/0!"},19.602246946188899,62.561396014623881,{"$error":"#DIV/0!"},1,{"$error":"#DIV/0!"},7.3940240505764878E-4,{"$error":"#DIV/0!"},6.7806989366276792E-4,{"$error":"#DIV/0!"},6.7806989366276792E-4,29.393055942649141,{"$error":"#DIV/0!"},1.0710979772053045E-3,{"$error":"#DIV/0!"},1.0710979772053045E-3]
[null,null,null,null,null,null,null,null,null,null,null,null,null,null,null,null,null,null,null,null,null,null,null,null,null,48.694686130641806,0.69,82.865782351565372,0.37999999999999901,{"$error":"#DIV/0!"},19.602246946188899,63.263535405376473,{"$error":"#DIV/0!"},1,{"$error":"#DIV/0!"},7.3119604177298344E-4,{"$error":"#DIV/0!"},7.0067222345151722E-4,{"$error":"#DIV/0!"},7.0067222345151722E-4,29.306775718016247,{"$error":"#DIV/0!"},1.0530009693735748E-3,{"$error":"#DIV/0!"},1.0530009693735748E-3]
[null,null,null,null,null,null,null,null,null,null,null,null,null,null,null,null,null,null,null,null,null,null,null,null,null,50.265482457436683,0.68,{"$f":"3*G$21^2/($BT$98*$BR$98*($BN$98/($BR$98*AA133)+2*$BP$98/$BR$98+AA133*$BR$98/$BN$98))","v":83.575173629580107},0.35999999999999899,{"$f":"3*G$21^2/($BU$98*$BS$98*($BO$98/($BS$98*AC133)+2*$BQ$98/$BS$98+AC133*$BS$98/$BO$98))","v":{"$error":"#DIV/0!"}},19.602246946188899,63.972926683391208,{"$error":"#DIV/0!"},{"$f":"IF(AF133>0,1,0)","v":1},{"$f":"IF(AG133>0,1,0)","v":{"$error":"#DIV/0!"}},7.2308786036807222E-4,{"$error":"#DIV/0!"},{"$f":"(Z133)*AF133*AJ133/$Z$23/3600","v":7.2327455324028549E-4},{"$f":"Z133*AG133*AK133/$Z$23/3600","v":{"$error":"#DIV/0!"}},7.2327455324028549E-4,{"$f":"$G$21/SQRT($BN$98^2/AA133^2+$BR$98^2+2*$BN$98/AA133*$BP$98)*AH133","v":29.217898629904205},{"$f":"$G$21/SQRT($BO$98^2/AC133^2+$BS$98^2+2*$BO$98/AC133*$BQ$98)*AI133","v":{"$error":"#DIV/0!"}},1.0350179559029638E-3,{"$error":"#DIV/0!"},1.0350179559029638E-3]
[null,null,null,null,null,null,null,null,null,null,null,null,null,null,null,null,null,null,null,null,null,null,null,null,null,51.836278784231581,0.67,84.291659050515506,0.33999999999999903,{"$error":"#DIV/0!"},19.602246946188899,64.689412104326607,{"$error":"#DIV/0!"},1,{"$error":"#DIV/0!"},7.1507910138949985E-4,{"$error":"#DIV/0!"},7.4587688302904455E-4,{"$error":"#DIV/0!"},7.4587688302904455E-4,29.126317551641698,{"$error":"#DIV/0!"},1.0171478929363075E-3,{"$error":"#DIV/0!"},1.0171478929363075E-3]
[null,null,null,null,null,null,null,null,null,null,null,null,null,null,null,null,null,null,null,null,null,null,null,null,null,53.407075111026479,0.66,85.015051605504595,0.31999999999999901,{"$error":"#DIV/0!"},19.602246946188899,65.412804659315697,{"$error":"#DIV/0!"},1,{"$error":"#DIV/0!"},7.0717112525443609E-4,{"$error":"#DIV/0!"},7.6847921281780328E-4,{"$error":"#DIV/0!"},7.6847921281780328E-4,29.031919904438904,{"$error":"#DIV/0!"},9.993897511774907E-4,{"$error":"#DIV/0!"},9.993897511774907E-4]
[null,null,null,null,null,null,null,null,null,null,null,null,null,null,null,null,null,null,null,null,null,null,null,null,null,54.977871437821378,0.65,85.745132021612818,0.29999999999999899,{"$error":"#DIV/0!"},19.602246946188899,66.142885075423919,{"$error":"#DIV/0!"},1,{"$error":"#DIV/0!"},6.9936542115192016E-4,{"$error":"#DIV/0!"},7.9108154260656234E-4,{"$error":"#DIV/0!"},7.9108154260656234E-4,28.934587337324189,{"$error":"#DIV/0!"},9.8174251578884877E-4,{"$error":"#DIV/0!"},9.8174251578884877E-4]
[null,null,null,null,null,null,null,null,null,null,null,null,null,null,null,null,null,null,null,null,null,null,null,null,null,56.548667764616276,0.64,86.481645474444022,0.27999999999999903,{"$error":"#DIV/0!"},19.602246946188899,66.879398528255123,{"$error":"#DIV/0!"},1,{"$error":"#DIV/0!"},6.9166361682265818E-4,{"$error":"#DIV/0!"},8.1368387239532129E-4,{"$error":"#DIV/0!"},8.1368387239532129E-4,28.834195386679713,{"$error":"#DIV/0!"},9.6420518630254792E-4,{"$error":"#DIV/0!"},9.6420518630254792E-4]
[null,null,null,null,null,null,null,null,null,null,null,null,null,null,null,null,null,null,null,null,null,null,null,null,null,58.119464091411174,0.63,87.224297985439705,0.25999999999999901,{"$error":"#DIV/0!"},19.602246946188899,67.622051039250806,{"$error":"#DIV/0!"},1,{"$error":"#DIV/0!"},6.8406748931833944E-4,{"$error":"#DIV/0!"},8.3628620218408024E-4,{"$error":"#DIV/0!"},8.3628620218408024E-4,28.730613114077009,{"$error":"#DIV/0!"},9.4677677654691334E-4,{"$error":"#DIV/0!"},9.4677677654691334E-4]
[null,null,null,null,null,null,null,null,null,null,null,null,null,null,null,null,null,null,null,null,null,null,null,null,null,59.690260418206073,0.62,87.972752473857824,0.23999999999999899,{"$error":"#DIV/0!"},19.602246946188899,68.370505527668925,{"$error":"#DIV/0!"},1,{"$error":"#DIV/0!"},6.7657897685511031E-4,{"$error":"#DIV/0!"},8.5888853197283919E-4,{"$error":"#DIV/0!"},8.5888853197283919E-4,28.623702721046989,{"$error":"#DIV/0!"},9.2945631458896442E-4,{"$error":"#DIV/0!"},9.2945631458896442E-4]
[null,null,null,null,null,null,null,null,null,null,null,null,null,null,null,null,null,null,null,null,null,null,null,null,null,61.261056745000971,0.61,88.726624430645558,0.219999999999999,{"$error":"#DIV/0!"},19.602246946188899,69.124377484456659,{"$error":"#DIV/0!"},1,{"$error":"#DIV/0!"},6.6920019189147147E-4,{"$error":"#DIV/0!"},8.8149086176159824E-4,{"$error":"#DIV/0!"},8.8149086176159824E-4,28.513319139352909,{"$error":"#DIV/0!"},9.1224284269456957E-4,{"$error":"#DIV/0!"},9.1224284269456957E-4]
[null,null,null,null,null,null,null,null,null,null,null,null,null,null,null,null,null,null,null,null,null,null,null,null,null,62.831853071795869,0.6,89.485477178423253,0.19999999999999901,{"$error":"#DIV/0!"},19.602246946188899,69.883230232234354,{"$error":"#DIV/0!"},1,{"$error":"#DIV/0!"},6.6193343557893964E-4,{"$error":"#DIV/0!"},9.0409319155035719E-4,{"$error":"#DIV/0!"},9.0409319155035719E-4,28.3993095952708,{"$error":"#DIV/0!"},8.9513541730784694E-4,{"$error":"#DIV/0!"},8.9513541730784694E-4]
[null,null,null,null,null,null,null,null,null,null,null,null,null,null,null,null,null,null,null,null,null,null,null,null,null,64.402649398590768,0.59,90.248816678566868,0.17999999999999899,{"$error":"#DIV/0!"},19.602246946188899,70.646569732377969,{"$error":"#DIV/0!"},1,{"$error":"#DIV/0!"},6.5478121375475934E-4,{"$error":"#DIV/0!"},9.2669552133911159E-4,{"$error":"#DIV/0!"},9.2669552133911159E-4,28.281513146321419,{"$error":"#DIV/0!"},8.7813310905168046E-4,{"$error":"#DIV/0!"},8.7813310905168046E-4]
[null,null,null,null,null,null,null,null,null,null,null,null,null,null,null,null,null,null,null,null,null,null,null,null,null,65.973445725385659,0.57999999999999996,91.016085842905937,0.159999999999999,{"$error":"#DIV/0!"},19.602246946188899,71.413838896717039,{"$error":"#DIV/0!"},1,{"$error":"#DIV/0!"},6.4774625467030648E-4,{"$error":"#DIV/0!"},9.4929785112787921E-4,{"$error":"#DIV/0!"},9.4929785112787921E-4,28.159760188842355,{"$error":"#DIV/0!"},8.6123500275152765E-4,{"$error":"#DIV/0!"},8.6123500275152765E-4]
[null,null,null,null,null,null,null,null,null,null,null,null,null,null,null,null,null,null,null,null,null,null,null,null,null,67.544242052180564,0.56999999999999995,91.786658303839459,0.13999999999999899,{"$error":"#DIV/0!"},19.602246946188899,72.184411357650561,{"$error":"#DIV/0!"},1,{"$error":"#DIV/0!"},6.4083152867705072E-4,{"$error":"#DIV/0!"},9.7190018091662059E-4,{"$error":"#DIV/0!"},9.7190018091662059E-4,28.033871934741306,{"$error":"#DIV/0!"},8.4444019748488284E-4,{"$error":"#DIV/0!"},8.4444019748488284E-4]
[null,null,null,null,null,null,null,null,null,null,null,null,null,null,null,null,null,null,null,null,null,null,null,null,null,69.115038378975441,0.56000000000000005,92.559831592715994,0.119999999999999,{"$error":"#DIV/0!"},19.602246946188899,72.957584646527096,{"$error":"#DIV/0!"},1,{"$error":"#DIV/0!"},6.3404027012534982E-4,{"$error":"#DIV/0!"},9.94502510705397E-4,{"$error":"#DIV/0!"},9.94502510705397E-4,27.903659855733988,{"$error":"#DIV/0!"},8.2774780665954904E-4,{"$error":"#DIV/0!"},8.2774780665954904E-4]
[null,null,null,null,null,null,null,null,null,null,null,null,null,null,null,null,null,null,null,null,null,null,null,null,null,70.685834705770347,0.55000000000000004,93.334819672131175,9.9999999999999006E-2,{"$error":"#DIV/0!"},19.602246946188899,73.732572725942276,{"$error":"#DIV/0!"},1,{"$error":"#DIV/0!"},6.2737600176944767E-4,{"$error":"#DIV/0!"},1.0171048404941469E-3,{"$error":"#DIV/0!"},1.0171048404941469E-3,27.768925093346571,{"$error":"#DIV/0!"},8.1115695812348663E-4,{"$error":"#DIV/0!"},8.1115695812348663E-4]
[null,null,null,null,null,null,null,null,null,null,null,null,null,null,null,null,null,null,null,null,null,null,null,null,null,72.256631032565238,0.54,94.110744763382471,7.9999999999999002E-2,{"$error":"#DIV/0!"},19.602246946188899,74.508497817193572,{"$error":"#DIV/0!"},1,{"$error":"#DIV/0!"},6.208425620185113E-4,{"$error":"#DIV/0!"},1.0397071702829153E-3,{"$error":"#DIV/0!"},1.0397071702829153E-3,27.629457832956763,{"$error":"#DIV/0!"},7.9466679431079777E-4,{"$error":"#DIV/0!"},7.9466679431079777E-4]
[null,null,null,null,null,null,null,null,null,null,null,null,null,null,null,null,null,null,null,null,null,null,null,null,null,73.827427359360144,0.53,94.886628405713708,5.9999999999999103E-2,{"$error":"#DIV/0!"},19.602246946188899,75.284381459524809,{"$error":"#DIV/0!"},1,{"$error":"#DIV/0!"},6.1444413542597058E-4,{"$error":"#DIV/0!"},1.0623095000716646E-3,{"$error":"#DIV/0!"},1.0623095000716646E-3,27.485036640164733,{"$error":"#DIV/0!"},7.7827647242753259E-4,{"$error":"#DIV/0!"},7.7827647242753259E-4]
[null,null,null,null,null,null,null,null,null,null,null,null,null,null,null,null,null,null,null,null,null,null,null,null,null,75.398223686155035,0.52,95.661381679215665,3.9999999999999002E-2,{"$error":"#DIV/0!"},19.602246946188899,76.059134733026767,{"$error":"#DIV/0!"},1,{"$error":"#DIV/0!"},6.081852868737766E-4,{"$error":"#DIV/0!"},1.0849118298604332E-3,{"$error":"#DIV/0!"},1.0849118298604332E-3,27.335427757831638,{"$error":"#DIV/0!"},7.6198516468314957E-4,{"$error":"#DIV/0!"},7.6198516468314957E-4]
[null,null,null,null,null,null,null,null,null,null,null,null,null,null,null,null,null,null,null,null,null,null,null,null,null,76.96902001294994,0.51,96.433794518386037,1.9999999999999001E-2,{"$error":"#DIV/0!"},19.602246946188899,76.831547572197138,{"$error":"#DIV/0!"},1,{"$error":"#DIV/0!"},6.0207099998225197E-4,{"$error":"#DIV/0!"},1.1075141596491823E-3,{"$error":"#DIV/0!"},1.1075141596491823E-3,27.180384362205647,{"$error":"#DIV/0!"},7.4579205857311837E-4,{"$error":"#DIV/0!"},7.4579205857311837E-4]
[null,null,null,null,null,null,null,null,null,null,null,null,null,null,null,null,null,null,null,null,null,null,null,null,null,78.539816339744831,0.5,97.202524038461547,0,0,19.602246946188899,77.600277092272648,-19.602246946188899,1,0,5.9610672036611865E-4,0,1.1301164894379412E-3,0,1.1301164894379412E-3,27.019645776683532,0,7.2969635722021278E-4,0,7.2969635722021278E-4]
[null,null,null,null,null,null,null,null,null,null,null,null,null,null,null,null,null,null,null,null,null,null,null,null,null,80.110612666539723,0.49,97.966081791830717,null,null,19.602246946188899,78.363834845641819,null,{"$f":"IF(AF152>0,1,0)","v":1},{"$f":"IF(AG152>0,1,0)","v":0},5.9029840446290691E-4,null,1.1527188192267102E-3,null,1.1527188192267102E-3,26.852936641938854,null,7.1369727978235972E-4,null,7.1369727978235972E-4]
[null,null,null,null,null,null,null,null,null,null,null,null,null,null,null,null,null,null,null,null,null,null,null,null,null,81.681408993334628,0.48,98.722819867246514,null,null,19.602246946188899,79.120572921057615,null,1,0,5.8465257478773017E-4,null,1.1753211490154588E-3,null,1.1753211490154588E-3,26.679966041399265,null,6.9779406193705277E-4,null,6.9779406193705277E-4]
[null,null,null,null,null,null,null,null,null,null,null,null,null,null,null,null,null,null,null,null,null,null,null,null,null,83.252205320129519,0.47,99.470915740371225,null,null,19.602246946188899,79.868668794182327,null,1,0,5.7917638262109826E-4,null,1.1979234788042283E-3,null,1.1979234788042283E-3,26.50042658138948,null,6.8198595645381076E-4,null,6.8198595645381076E-4]
[null,null,null,null,null,null,null,null,null,null,null,null,null,null,null,null,null,null,null,null,null,null,null,null,null,84.823001646924425,0.46,100.20835578062709,null,null,19.602246946188899,80.606108834438189,null,1,0,5.7387767932066936E-4,null,1.2205258085929765E-3,null,1.2205258085929765E-3,26.313993425690917,null,6.6627223386809067E-4,null,6.6627223386809067E-4]
[null,null,null,null,null,null,null,null,null,null,null,null,null,null,null,null,null,null,null,null,null,null,null,null,null,86.393797973719316,0.45,100.93291731669268,null,null,19.602246946188899,81.330670370503782,null,1,0,5.6876509767161011E-4,null,1.2431281383817466E-3,null,1.2431281383817466E-3,26.120323284824178,null,6.5065218327319191E-4,null,6.5065218327319191E-4]
[null,null,null,null,null,null,null,null,null,null,null,null,null,null,null,null,null,null,null,null,null,null,null,null,null,87.964594300514221,0.44,101.64214916164416,null,null,19.602246946188899,82.039902215455257,null,1,0,5.6384814496117798E-4,null,1.2657304681706087E-3,null,1.2657304681706087E-3,25.919053361060488,null,6.3512511324911793E-4,null,6.3512511324911793E-4]
[null,null,null,null,null,null,null,null,null,null,null,null,null,null,null,null,null,null,null,null,null,null,null,null,null,89.535390627309255,0.42999999999999899,102.33335049915773,null,null,19.602246946188899,82.731103552968833,null,1,0,5.5913730979498244E-4,null,1.2883327979592665E-3,null,1.2883327979592665E-3,25.709800251041575,null,6.1969035295150092E-4,null,6.1969035295150092E-4]
[null,null,null,null,null,null,null,null,null,null,null,null,null,null,null,null,null,null,null,null,null,null,null,null,null,91.10618695410416,0.41999999999999899,103.00354803493458,null,null,19.602246946188899,83.401301088745683,null,1,0,5.5464418507997161E-4,null,1.310935127748014E-3,null,1.310935127748014E-3,25.492158808966263,null,6.0434725338920619E-4,null,6.0434725338920619E-4]
[null,null,null,null,null,null,null,null,null,null,null,null,null,null,null,null,null,null,null,null,null,null,null,null,null,92.676983280899051,0.40999999999999898,103.64947132329388,null,null,19.602246946188899,84.047224377104982,null,1,0,5.5038161009845446E-4,null,1.3335374575367848E-3,null,1.3335374575367848E-3,25.265700974624291,null,5.8909518892249807E-4,null,5.8909518892249807E-4]
[null,null,null,null,null,null,null,null,null,null,null,null,null,null,null,null,null,null,null,null,null,null,null,null,null,94.247779607693957,0.39999999999999902,104.26752618855768,null,null,19.602246946188899,84.665279242368783,null,1,0,5.4636383522169878E-4,null,1.3561397873255315E-3,null,1.3561397873255315E-3,25.02997457216798,null,5.7393355902412484E-4,null,5.7393355902412484E-4]
[null,null,null,null,null,null,null,null,null,null,null,null,null,null,null,null,null,null,null,null,null,null,null,null,null,95.818575934488848,0.38999999999999901,104.85376617548064,null,null,19.602246946188899,85.251519229291745,null,1,0,5.4260671358315464E-4,null,1.3787421171143027E-3,null,1.3787421171143027E-3,24.784502087457984,null,5.5886179035201204E-4,null,5.5886179035201204E-4]
[null,null,null,null,null,null,null,null,null,null,null,null,null,null,null,null,null,null,null,null,null,null,null,null,null,97.389372261283754,0.37999999999999901,105.40386198381128,null,null,19.602246946188899,85.801615037622383,null,1,0,5.391279250011019E-4,null,1.4013444469030496E-3,null,1.4013444469030496E-3,24.528779434158693,null,5.4387933919431623E-4,null,5.4387933919431623E-4]
[null,null,null,null,null,null,null,null,null,null,null,null,null,null,null,null,null,null,null,null,null,null,null,null,null,98.960168588078645,0.369999999999999,105.91306887062098,null,null,19.602246946188899,86.310821924432076,null,1,0,5.3594723866119047E-4,null,1.4239467766918208E-3,null,1.4239467766918208E-3,24.262274721553798,null,5.2898569436182329E-4,null,5.2898569436182329E-4]
[null,null,null,null,null,null,null,null,null,null,null,null,null,null,null,null,null,null,null,null,null,null,null,null,null,100.53096491487355,0.35999999999999899,{"$f":"3*G$21^2/($BT$98*$BR$98*($BN$98/($BR$98*AA165)+2*$BP$98/$BR$98+AA165*$BR$98/$BN$98))","v":106.37619204209147},null,null,19.602246946188899,86.773945095902576,null,1,0,5.330868226153864E-4,null,{"$f":"(Z165)*AF165*AJ165/$Z$23/3600","v":1.4465491064805671E-3},null,1.4465491064805671E-3,{"$f":"$G$21/SQRT($BN$98^2/AA165^2+$BR$98^2+2*$BN$98/AA165*$BP$98)*AH165","v":23.984427040372822},null,5.1418038061982075E-4,null,5.1418038061982075E-4]
[null,null,null,null,null,null,null,null,null,null,null,null,null,null,null,null,null,null,null,null,null,null,null,null,null,{"$f":"(1-AA166)*$BT$98","v":102.10176124166844},0.34999999999999898,106.78755010610708,null,null,{"$f":"$G$57","v":19.602246946188899},{"$f":"AB166-AE166","v":87.185303159918178},null,1,0,{"$f":"(Z167-Z166)*$Z$71*AH166/AF166","v":5.3057161012709509E-4},null,1.4691514362693259E-3,null,{"$f":"IF($Z$8=1,IF(AI166=1,AM166,AL166),AL166)","v":1.4691514362693259E-3},23.694645286842558,null,{"$f":"AO166^2*($BP$98+$BN$98)/3600*AJ166*AH166","v":4.9946296277487501E-4},null,{"$f":"IF($Z$8=1,IF(AI166=1,AR166,AQ166),AQ166)","v":4.9946296277487501E-4}]
[null,null,null,null,null,null,null,null,null,null,null,null,null,null,null,null,null,null,null,null,null,null,null,null,null,103.67255756846333,0.33999999999999903,107.14093672069829,null,null,19.602246946188899,87.538689774509393,null,1,0,5.2842973542479394E-4,null,1.4917537660580978E-3,null,1.4917537660580978E-3,23.392307049783817,null,4.8483305056042921E-4,null,4.8483305056042921E-4]
[null,null,null,null,null,null,null,null,null,null,null,null,null,null,null,null,null,null,null,null,null,null,null,null,null,105.24335389525824,0.32999999999999902,107.42958065392632,null,null,19.602246946188899,87.827333707737424,null,1,0,5.2669305470332689E-4,null,1.5143560958468436E-3,null,1.5143560958468436E-3,23.076757590951264,null,4.7029030450321545E-4,null,4.7029030450321545E-4]
[null,null,null,null,null,null,null,null,null,null,null,null,null,null,null,null,null,null,null,null,null,null,null,null,null,106.81415022205313,0.31999999999999901,107.64610457135728,null,null,19.602246946188899,88.043857625168386,null,1,0,5.2539777248190108E-4,null,1.5369584256356161E-3,null,1.5369584256356161E-3,22.747308955049075,null,4.5583444300130931E-4,null,4.5583444300130931E-4]
[null,null,null,null,null,null,null,null,null,null,null,null,null,null,null,null,null,null,null,null,null,null,null,null,null,108.38494654884803,0.309999999999999,107.78248299136942,null,null,19.602246946188899,88.180236045180521,null,1,0,5.245851990379756E-4,null,1.5595607554243611E-3,null,1.5595607554243611E-3,22.403239253033043,null,4.4146525090893712E-4,null,4.4146525090893712E-4]
[null,null,null,null,null,null,null,null,null,null,null,null,null,null,null,null,null,null,null,null,null,null,null,null,null,109.95574287564293,0.29999999999999899,107.83,null,null,19.602246946188899,88.227753053811099,null,1,0,5.2430267207149441E-4,null,1.5821630852131342E-3,null,1.5821630852131342E-3,22.043792170507835,null,4.2718259000890129E-4,null,4.2718259000890129E-4]
[null,null,null,null,null,null,null,null,null,null,null,null,null,null,null,null,null,null,null,null,null,null,null,null,null,111.52653920243783,0.28999999999999898,107.77920749991384,null,null,19.602246946188899,88.176960553724939,null,1,0,5.2460468569668966E-4,null,1.604765415001864E-3,null,1.604765415001864E-3,21.668176762306565,null,4.1298641186713741E-4,null,4.1298641186713741E-4]
[null,null,null,null,null,null,null,null,null,null,null,null,null,null,null,null,null,null,null,null,null,null,null,null,null,113.09733552923271,0.27999999999999903,107.61988498645501,null,null,19.602246946188899,88.017638040266107,null,1,0,5.2555428328825507E-4,null,1.6273677447906519E-3,null,1.6273677447906519E-3,21.275567604733371,null,3.9887677371866633E-4,null,3.9887677371866633E-4]
[null,null,null,null,null,null,null,null,null,null,null,null,null,null,null,null,null,null,null,null,null,null,null,null,null,114.66813185602761,0.26999999999999902,107.34100210153741,null,null,19.602246946188899,87.738755155348514,null,1,0,5.2722478903505189E-4,null,1.649970074579396E-3,null,1.649970074579396E-3,20.865105388450395,null,3.8485385824400424E-4,null,3.8485385824400424E-4]
[null,null,null,null,null,null,null,null,null,null,null,null,null,null,null,null,null,null,null,null,null,null,null,null,null,116.23892818282251,0.25999999999999901,106.93068551668017,null,null,19.602246946188899,87.328438570491272,null,1,0,5.2970197834967291E-4,null,1.6725724043681702E-3,null,1.6725724043681702E-3,20.435898047532227,null,3.7091799838621828E-4,null,3.7091799838621828E-4]
[null,null,null,null,null,null,null,null,null,null,null,null,null,null,null,null,null,null,null,null,null,null,null,null,null,117.80972450961741,0.249999999999999,106.37619204209138,null,null,19.602246946188899,86.773945095902477,null,1,0,5.3308682261538705E-4,null,1.6951747341569143E-3,null,1.6951747341569143E-3,19.987022533643998,null,3.570697087637641E-4,null,3.570697087637641E-4]
[null,null,null,null,null,null,null,null,null,null,null,null,null,null,null,null,null,null,null,null,null,null,null,null,null,119.3805208364123,0.23999999999999899,105.66389024987744,null,null,19.602246946188899,86.061643303688541,null,1,0,5.3749899375898306E-4,null,1.7177770639456883E-3,null,1.7177770639456883E-3,19.5175273583631,null,3.4330972580905747E-4,null,3.4330972580905747E-4]
[null,null,null,null,null,null,null,null,null,null,null,null,null,null,null,null,null,null,null,null,null,null,null,null,null,120.95131716320721,0.22999999999999901,104.77925333408433,null,null,19.602246946188899,85.177006387895432,null,1,0,5.4308138591203719E-4,null,1.740379393734432E-3,null,1.740379393734432E-3,19.026436040953563,null,3.2963905958626513E-4,null,3.2963905958626513E-4]
[null,null,null,null,null,null,null,null,null,null,null,null,null,null,null,null,null,null,null,null,null,null,null,null,null,122.5221134900021,0.219999999999999,103.70686640242469,null,null,19.602246946188899,84.104619456235795,null,1,0,5.5000601603158396E-4,null,1.7629817235231904E-3,null,1.7629817235231904E-3,18.512751612825205,null,3.1605906144331045E-4,null,3.1605906144331045E-4]
[null,null,null,null,null,null,null,null,null,null,null,null,null,null,null,null,null,null,null,null,null,null,null,null,null,124.09290981679699,0.20999999999999899,102.43045189306541,null,null,19.602246946188899,82.828204946876511,null,1,0,5.584818203732074E-4,null,1.7855840533119495E-3,null,1.7855840533119495E-3,17.975462342647869,null,3.0257151343258661E-4,null,3.0257151343258661E-4]
[null,null,null,null,null,null,null,null,null,null,null,null,null,null,null,null,null,null,null,null,null,null,null,null,null,125.66370614359188,0.19999999999999901,100.93291731669251,null,null,19.602246946188899,81.330670370503611,null,1,0,5.687650976716062E-4,null,1.8081863831007083E-3,null,1.8081863831007083E-3,17.413548856549397,null,2.8917874812141488E-4,null,2.8917874812141488E-4]
[null,null,null,null,null,null,null,null,null,null,null,null,null,null,null,null,null,null,null,null,null,null,null,null,null,127.23450247038677,0.189999999999999,99.196430012426987,null,null,19.602246946188899,79.594183066238088,null,1,0,5.8117371012503857E-4,null,1.8307887128894832E-3,null,1.8307887128894832E-3,16.825992834590597,null,2.7588381154919605E-4,null,2.7588381154919605E-4]
[null,null,null,null,null,null,null,null,null,null,null,null,null,null,null,null,null,null,null,null,null,null,null,null,null,128.80529879718168,0.17999999999999899,97.202524038461348,null,null,19.602246946188899,77.600277092272449,null,1,0,5.9610672036612016E-4,null,1.8533910426782253E-3,null,1.8533910426782253E-3,16.211787466010055,null,2.6269068859927514E-4,null,2.6269068859927514E-4]
[null,null,null,null,null,null,null,null,null,null,null,null,null,null,null,null,null,null,null,null,null,null,null,null,null,130.37609512397657,0.16999999999999901,94.932244644305726,null,null,19.602246946188899,75.329997698116827,null,{"$f":"IF(AF184>0,1,0)","v":1},0,6.140720574870414E-4,null,1.8759933724669844E-3,null,1.8759933724669844E-3,15.569949839416102,null,2.4960462055782404E-4,null,2.4960462055782404E-4]
[null,null,null,null,null,null,null,null,null,null,null,null,null,null,null,null,null,null,null,null,null,null,null,null,null,131.94689145077146,0.159999999999999,92.366335926903858,null,null,19.602246946188899,72.764088980714959,null,1,0,6.3572632221421113E-4,null,1.8985957022557777E-3,null,1.8985957022557777E-3,14.89953542765252,null,2.3663256204966391E-4,null,2.3663256204966391E-4]
[null,null,null,null,null,null,null,null,null,null,null,null,null,null,null,null,null,null,null,null,null,null,null,null,null,133.51768777756638,0.149999999999999,89.48547717842294,null,null,19.602246946188899,69.883230232234041,null,1,0,6.6193343557893953E-4,null,1.9211980320445021E-3,null,1.9211980320445021E-3,14.199654797635329,null,2.2378385432695946E-4,null,2.2378385432695946E-4]
[null,null,null,null,null,null,null,null,null,null,null,null,null,null,null,null,null,null,null,null,null,null,null,null,null,135.08848410436127,0.13999999999999899,86.270572996037458,null,null,19.602246946188899,66.668326049848559,null,1,0,6.9385342962397314E-4,null,1.9438003618332614E-3,null,1.9438003618332614E-3,13.469492629999802,null,2.1107124463489542E-4,null,2.1107124463489542E-4]
[null,null,null,null,null,null,null,null,null,null,null,null,null,null,null,null,null,null,null,null,null,null,null,null,null,136.65928043115616,0.12999999999999901,82.703101339259021,null,null,19.602246946188899,63.100854393070122,null,1,0,7.3308114639501385E-4,null,1.9664026916220195E-3,null,1.9664026916220195E-3,12.708329068842627,null,1.9851247860022046E-4,null,1.9851247860022046E-4]
[null,null,null,null,null,null,null,null,null,null,null,null,null,null,null,null,null,null,null,null,null,null,null,null,null,138.23007675795105,0.119999999999999,78.76552227903538,null,null,19.602246946188899,59.163275332846482,null,1,0,7.8187095654752938E-4,null,1.9890050214108144E-3,null,1.9890050214108144E-3,11.915563335409578,null,1.861328802547475E-4,null,1.861328802547475E-4]
[null,null,null,null,null,null,null,null,null,null,null,null,null,null,null,null,null,null,null,null,null,null,null,null,null,139.80087308474597,0.109999999999999,74.441748080583636,null,null,19.602246946188899,54.839501134394737,null,1,0,8.4351691244623943E-4,null,2.0116073511995377E-3,null,2.0116073511995377E-3,11.090739429174098,null,1.7396971668006843E-4,null,1.7396971668006843E-4]
[null,null,null,null,null,null,null,null,null,null,null,null,null,null,null,null,null,null,null,null,null,null,null,null,null,141.37166941154086,9.9999999999999006E-2,69.717672413792613,null,null,19.602246946188899,50.115425467603714,null,1,0,9.2303010989858679E-4,null,2.0342096809882961E-3,null,2.0342096809882961E-3,10.233573604517682,null,1.6207997505229027E-4,null,1.6207997505229027E-4]
[null,null,null,null,null,null,null,null,null,null,null,null,null,null,null,null,null,null,null,null,null,null,null,null,null,142.94246573833576,8.9999999999998997E-2,64.581752844878679,null,null,19.602246946188899,44.97950589868978,null,1,0,1.0284249627189471E-3,null,2.0568120107770553E-3,null,2.0568120107770553E-3,9.3439831521738981,null,1.5055513091604198E-4,null,1.5055513091604198E-4]
[null,null,null,null,null,null,null,null,null,null,null,null,null,null,null,null,null,null,null,null,null,null,null,null,null,144.51326206513065,7.9999999999999002E-2,59.025636347048064,null,null,19.602246946188899,39.423389400859165,null,1,0,1.1733655421309001E-3,null,2.0794143405658137E-3,null,2.0794143405658137E-3,8.4221158353309669,null,1.3955153203395611E-4,null,1.3955153203395611E-4]
[null,null,null,null,null,null,null,null,null,null,null,null,null,null,null,null,null,null,null,null,null,null,null,null,null,146.08405839192554,6.9999999999998994E-2,53.044812480966364,null,null,19.602246946188899,33.442565534777465,null,1,0,1.3832086724588221E-3,null,2.1020166703545726E-3,null,2.1020166703545726E-3,7.4683791376782338,null,1.2935978206909851E-4,null,1.2935978206909851E-4]
[null,null,null,null,null,null,null,null,null,null,null,null,null,null,null,null,null,null,null,null,null,null,null,null,null,147.65485471872043,5.9999999999999103E-2,46.639273356400786,null,null,19.602246946188899,27.037026410211887,null,1,0,1.7109147276456787E-3,null,2.124619000143331E-3,null,2.124619000143331E-3,6.4834682854434016,null,1.2058742020132156E-4,null,1.2058742020132156E-4]
[null,null,null,null,null,null,null,null,null,null,null,null,null,null,null,null,null,null,null,null,null,null,null,null,null,149.22565104551532,4.9999999999998997E-2,39.81415384615314,null,null,19.602246946188899,20.211906899964241,null,1,0,2.2886532629466726E-3,null,2.1472213299321284E-3,null,2.1472213299321284E-3,5.4683918224171277,null,1.1475143072608585E-4,null,1.1475143072608585E-4]
[null,null,null,null,null,null,null,null,null,null,null,null,null,null,null,null,null,null,null,null,null,null,null,null,null,150.79644737231024,3.9999999999999002E-2,{"$f":"3*G$21^2/($BT$98*$BR$98*($BN$98/($BR$98*AA197)+2*$BP$98/$BR$98+AA197*$BR$98/$BN$98))","v":32.580320273944267},null,null,19.602246946188899,12.978073327755368,null,1,0,3.5643231093514935E-3,null,2.1698236597208495E-3,null,2.1698236597208495E-3,4.4244933648001412,null,1.1699384666589912E-4,null,1.1699384666589912E-4]
[null,null,null,null,null,null,null,null,null,null,null,null,null,null,null,null,null,null,null,null,null,null,null,null,null,152.36724369910513,2.9999999999999E-2,{"$f":"3*G$21^2/($BT$98*$BR$98*($BN$98/($BR$98*AA198)+2*$BP$98/$BR$98+AA198*$BR$98/$BN$98))","v":24.954871557509058},null,null,19.602246946188899,5.3526246113201594,null,1,0,8.642124198126367E-3,null,2.1924259895096079E-3,null,2.1924259895096079E-3,3.3534680631207121,null,1.6295500747957214E-4,null,1.6295500747957214E-4]
[null,null,null,null,null,null,null,null,null,null,null,null,null,null,null,null,null,null,null,null,null,null,null,null,null,153.93804002590002,1.9999999999999001E-2,{"$f":"3*G$21^2/($BT$98*$BR$98*($BN$98/($BR$98*AA199)+2*$BP$98/$BR$98+AA199*$BR$98/$BN$98))","v":16.961514261744149},null,null,19.602246946188899,-2.6407326844447496,null,0,0,0,null,0,null,0,0,null,{"$f":"AO199^2*($BP$98+$BN$98)/3600*AJ199*AH199","v":0},null,0]
[null,null,null,null,null,null,null,null,null,null,null,null,null,null,null,null,null,null,null,null,null,null,null,null,null,155.50883635269491,9.9999999999990097E-3,{"$f":"3*G$21^2/($BT$98*$BR$98*($BN$98/($BR$98*AA200)+2*$BP$98/$BR$98+AA200*$BR$98/$BN$98))","v":8.6307729249478005},null,null,19.602246946188899,-10.971474021241098,null,0,0,0,null,0,null,0,0,null,0,null,0]
[null,null,null,null,null,null,null,null,null,null,null,null,null,null,null,null,null,null,null,null,null,null,null,null,null,157.07963267948966,0,0,null,null,19.602246946188899,-19.602246946188899,null,0,0,0,null,0,null,0,0,null,0,null,0]
[]
[null,null,null,null,null,null,null,null,null,null,null,null,null,null,null,null,null,null,null,null,null,null,null,null,null,null,null,null,null,null,null,null,null,null,null,null,null,null,"Energia",{"$f":"SUM(AN101:AN201)","v":0.10742887348597129},null,null,null,null,{"$f":"SUM(AS101:AS201)","v":7.7976974744565816E-2}]

{"sheet":"Foglio2","index":1,"n_rows":87,"n_cols":53,"rows_kept":87,"cut":false,"hidden":false,"merged":[[79,0,79,16],[48,1,49,7],[53,1,53,5],[61,0,63,6],[49,8,49,9],[0,19,0,26],[1,3,1,5],[1,7,1,8],[1,9,1,11],[1,12,1,14],[0,1,0,6],[0,7,0,18],[47,1,47,15],[3,5,3,15],[19,5,19,15],[32,0,32,9],[37,0,37,14]]}
[null,"INPUT",null,null,null,null,null,"OUTPUT",null,null,null,null,null,null,null,null,null,null,null,"Dimension"]
[null,null,null,"AC input current",null,null,null,"AC output current (duty cucle =80%)",null,"Inverte Output",null,null,"Pn Mot (Reccommended motor output)",null,null,null,null,null,null,null,null,null,null,null,null,null,null,null,{"$f":"Foglio1!G21","v":400},{"$f":"Foglio1!Z21","v":4}]
[null,"Uln AC imput","AC imput frequncy","At 230 V","At 400 V","At 480 V","THD with DC choke","At 230-400 V","At 480 V","At 230 V","At 400 V","At 480 V","At 230 V","At 400 V","At 480 V","Max Overload","U2 Max Output voltage","f2 Max output frequency","fsw Switching frequency max","W","H","D","Weight","W","H","D","Wei",null,"P(Tens)","Prif","scelta"]
[null,null,null,null,null,"ADL100"]
[1040,"230-400-460/480 Vac -15÷10% 3Ph","50/60 ± 5%",12,11,10,"<35 %",9,8.1,3.6,6.8,6.7,2,4,5,"200% * 10Sec with output frequency more than 3Hz   150% with output frequency less than 3Hz","0,98 * Uln (AC Imput Voltage)",300,10,159.19999999999999,331.1,158.69999999999999,5.8,6.27,13.04,6.25,12.8,{"$f":"IF($AC$2<230,0,1)","v":1},{"$f":"IF($AC$2<370,M5,IF($AC$2>=370,N5,0))","v":4},{"$f":"IF($AD$2<=AC5,1,0)*AB5","v":1},{"$f":"AND(AD4=0,AD5=1)","v":true},{"$f":"AE5*A5","v":1040},{"$f":"$AE5*D5","v":12},{"$f":"$AE5*E5","v":11},10,{"$f":"$AE5*H5","v":9},8.1,3.6,6.8,6.7,2,4,5,{"$f":"$AE5*R5","v":300},10,159.19999999999999,331.1,158.69999999999999,5.8,6.27,13.04,6.25,12.8]
[1055,"230-400-460/480 Vac -15÷10% 3Ph","50/60 ± 5%",17,16,15,"<35 %",13.5,12.2,5.4,9.4,10.1,3,5.5,7.5,"200% * 10Sec with output frequency more than 3Hz   150% with output frequency less than 3Hz","0,98 * Uln (AC Imput Voltage)",300,10,159.19999999999999,331.1,158.69999999999999,5.8,6.27,13.04,6.25,12.8,{"$f":"IF($AC$2<230,0,1)","v":1},5.5,{"$f":"IF($AD$2<=AC6,1,0)*AB6","v":1},{"$f":"AND(AD5=0,AD6=1)","v":false},{"$f":"AE6*A6","v":0},{"$f":"$AE6*D6","v":0},0,0,0,0,0,0,0,0,0,0,0,0,0,0,0,0,0,0,0,0]
[2075,"230-400-460/480 Vac -15÷10% 3Ph","50/60 ± 5%",23,22,20,"<35 %",18.5,16.7,7.4,12.8,13.9,4,7.5,10,"200% * 10Sec with output frequency more than 3Hz   150% with output frequency less than 3Hz","0,98 * Uln (AC Imput Voltage)",300,10,159.19999999999999,382.1,158.6,7.8,6.27,15.04,6.24,17.2,1,7.5,1,false,0,0,0,0,0,0,0,0,0,0,0,0,0,0,0,0,0,0,0,0,0,0]
[2110,"230-400-460/480 Vac -15÷10% 3Ph","50/60 ± 5%",31,25,26,"<35 %",24.5,22,9.8000000000000007,17.100000000000001,18.3,5.5,11,15,"200% * 10Sec with output frequency more than 3Hz   150% with output frequency less than 3Hz","0,98 * Uln (AC Imput Voltage)",300,10,159.19999999999999,382.1,158.6,7.8,6.27,15.04,6.24,17.2,1,11,1,false,0,0,0,0,0,0,0,0,0,0,0,0,0,0,0,0,0,0,0,0,0,0]
[3150,"230-400-460/480 Vac -15÷10% 3Ph","50/60 ± 5%",42,40,37,"<35 %",32,28.8,12.8,22.2,24,7.5,15,20,"200% * 10Sec with output frequency more than 3Hz   150% with output frequency less than 3Hz","0,98 * Uln (AC Imput Voltage)",300,10,227.8,387,178,10.5,8.9700000000000006,15.24,7.01,23.15,1,15,1,false,0,0,0,0,0,0,0,0,0,0,0,0,0,0,0,0,0,0,0,0,0,0]
[3185,"230-400-460/480 Vac -15÷10% 3Ph","50/60 ± 5%",50,47,45,"<35 %",39,35.1,15.6,27.1,29.2,11,18.5,25,"200% * 10Sec with output frequency more than 3Hz   150% with output frequency less than 3Hz","0,98 * Uln (AC Imput Voltage)",300,10,227.8,387,178,10.5,8.9700000000000006,15.24,7.01,23.15,1,18.5,1,false,0,0,0,0,0,0,0,0,0,0,0,0,0,0,0,0,0,0,0,0,0,0]
[3220,"230-400-460/480 Vac -15÷10% 3Ph","50/60 ± 5%",55,53,50,"<35 %",45,40.5,17.899999999999999,31.2,33.700000000000003,11,22,30,"200% * 10Sec with output frequency more than 3Hz   150% with output frequency less than 3Hz","0,98 * Uln (AC Imput Voltage)",300,10,227.8,387,178,10.5,8.9700000000000006,15.24,7.01,23.15,1,22,1,{"$f":"AND(AD10=0,AD11=1)","v":false},0,0,0,0,0,0,0,0,0,0,0,0,0,{"$f":"$AE11*S11","v":0},0,0,0,0,0,0,0,0]
[2055,"200-230 Vac ±10% 3Ph","50/60 ± 2%",31,null,null,"<35 %",24.5,null,9.8000000000000007,null,null,5.5,null,null,"150% * 10 sec from 0 to 3Hz  -  200% * 10 sec starting from 3Hz","0,98 * Uln (AC Imput Voltage)",300,"10/5 according to Heat-sink temperature",159.19999999999999,331.1,158.69999999999999,7.8,6.27,13.04,6.25,17.2,{"$f":"IF($AC$2<230,1,0)","v":0},{"$f":"M12","v":5.5},0,{"$f":"AND(AD11=0,AD12=1)","v":false},{"$f":"AE12*A12","v":0},{"$f":"$AE12*D12","v":0},{"$f":"$AE12*E12","v":0},{"$f":"$AE12*F12","v":0},{"$f":"$AE12*H12","v":0},{"$f":"$AE12*I12","v":0},{"$f":"$AE12*J12","v":0},{"$f":"$AE12*K12","v":0},{"$f":"$AE12*L12","v":0},{"$f":"$AE12*M12","v":0},{"$f":"$AE12*N12","v":0},{"$f":"$AE12*O12","v":0},{"$f":"$AE12*R12","v":0},{"$f":"$AE12*S12","v":{"$error":"#VALUE!"}},{"$f":"$AE12*T12","v":0},{"$f":"$AE12*U12","v":0},{"$f":"$AE12*V12","v":0},{"$f":"$AE12*W12","v":0},{"$f":"$AE12*X12","v":0},{"$f":"$AE12*Y12","v":0},{"$f":"$AE12*Z12","v":0},{"$f":"$AE12*AA12","v":0}]
[3075,"200-230 Vac ±10% 3Ph","50/60 ± 2%",42,null,null,"<35 %",32,null,12.8,null,null,7.5,null,null,"150% * 10 sec from 0 to 3Hz  -  200% * 10 sec starting from 3Hz","0,98 * Uln (AC Imput Voltage)",300,"10/5 according to Heat-sink temperature",227.8,387,178,10.5,8.9700000000000006,15.24,7.01,23.15,0,{"$f":"M13","v":7.5},0,{"$f":"AND(AD12=0,AD13=1)","v":false},0,0,0,0,0,0,0,0,0,0,0,0,0,{"$f":"$AE13*S13","v":{"$error":"#VALUE!"}},0,0,0,0,0,0,0,0]
[3110,"200-230 Vac ±10% 3Ph","50/60 ± 2%",53,null,null,"<35 %",45,null,17.899999999999999,null,null,11,null,null,"150% * 10 sec from 0 to 3Hz  -  200% * 10 sec starting from 3Hz","0,98 * Uln (AC Imput Voltage)",300,"10/5 according to Heat-sink temperature",227.8,387,178,10.5,8.9700000000000006,15.24,7.01,23.15,0,11,0,false,0,0,0,0,0,0,0,0,0,0,0,0,0,{"$error":"#VALUE!"},0,0,0,0,0,0,0,0]
[4150,"200-230 Vac ±10% 3Ph","50/60 ± 2%",55,null,null,"<35 %",60,null,23.9,null,null,15,null,null,"150% * 10 sec from 0 to 3Hz  -  180% * 10 sec starting from 3Hz","0,98 * Uln (AC Imput Voltage)",300,"10/5 according to Heat-sink temperature",268,612,275,32,10.55,24.09,10.87,70.599999999999994,0,15,0,false,0,0,0,0,0,0,0,0,0,0,0,0,0,{"$error":"#VALUE!"},0,0,0,0,0,0,0,0]
[4185,"200-230 Vac ±10% 3Ph","50/60 ± 2%",72,null,null,"<35 %",75,null,29.9,null,null,18.5,null,null,"150% * 10 sec from 0 to 3Hz  -  180% * 10 sec starting from 3Hz","0,98 * Uln (AC Imput Voltage)",300,"10/5 according to Heat-sink temperature",268,612,275,32,10.55,24.09,10.87,70.599999999999994,0,18.5,0,false,0,0,0,0,0,0,0,0,0,0,0,0,0,{"$error":"#VALUE!"},0,0,0,0,0,0,0,0]
[4220,"200-230 Vac ±10% 3Ph","50/60 ± 2%",89,null,null,"<35 %",90,null,35.799999999999997,null,null,22,null,null,"150% * 10 sec from 0 to 3Hz  -  180% * 10 sec starting from 3Hz","0,98 * Uln (AC Imput Voltage)",300,"10/5 according to Heat-sink temperature",268,612,275,32,10.55,24.09,10.87,70.599999999999994,0,22,0,false,0,0,0,0,0,0,0,0,0,0,0,0,0,{"$error":"#VALUE!"},0,0,0,0,0,0,0,0]
[5300,"200-230 Vac ±10% 3Ph","50/60 ± 2%",97,null,null,"<35 %",105,null,41.8,null,null,30,null,null,"150% * 10 sec from 0 to 3Hz  -  180% * 10 sec starting from 3Hz","0,98 * Uln (AC Imput Voltage)",300,"10/5 according to Heat-sink temperature",311,767,331,60,12,30.2,13.03,132.30000000000001,0,30,0,false,0,0,0,0,0,0,0,0,0,0,0,0,0,{"$error":"#VALUE!"},0,0,0,0,0,0,0,0]
[5370,"200-230 Vac ±10% 3Ph","50/60 ± 2%",136,null,null,"<35 %",150,null,59.8,null,null,37,null,null,"150% * 10 sec from 0 to 3Hz  -  180% * 10 sec starting from 3Hz","0,98 * Uln (AC Imput Voltage)",300,"10/5 according to Heat-sink temperature",311,767,331,60,12,30.2,13.03,132.30000000000001,0,37,0,false,0,0,0,0,0,0,0,0,0,0,0,0,0,{"$error":"#VALUE!"},0,0,0,0,0,0,0,0]
[null,null,null,null,null,"ADL200",null,null,null,null,null,null,null,null,null,null,null,null,null,null,null,null,null,null,null,null,null,null,null,null,null,{"$f":"SUM(AF5:AF19)","v":1040},{"$f":"SUM(AG5:AG19)","v":12},11,10,9,8.1,3.6,6.8,6.7,2,4,5,300,{"$error":"#VALUE!"},159.19999999999999,331.1,158.69999999999999,5.8,6.27,13.04,6.25,12.8]
[1040,"230-400-460/480 Vac -15÷10% 3Ph","50/60 ± 5%",12,11,10,"<35 %",9,8.1,3.6,6.8,6.7,2,4,5,"200% * 10Sec with output frequency more than 3Hz   150% with output frequency less than 3Hz","0,98 * Uln (AC Imput Voltage)",300,10,159.19999999999999,331.1,158.69999999999999,5.8,6.27,13.04,6.25,12.8,null,4,{"$f":"IF($AD$2<=AC21,1,0)","v":1},true,1040,{"$f":"$AE21*D21","v":12},{"$f":"$AE21*E21","v":11},{"$f":"$AE21*F21","v":10},{"$f":"$AE21*H21","v":9},{"$f":"$AE21*I21","v":8.1},{"$f":"$AE21*J21","v":3.6},{"$f":"$AE21*K21","v":6.8},{"$f":"$AE21*L21","v":6.7},{"$f":"$AE21*M21","v":2},{"$f":"$AE21*N21","v":4},{"$f":"$AE21*O21","v":5},{"$f":"$AE21*R21","v":300},{"$f":"$AE21*S21","v":10},{"$f":"$AE21*T21","v":159.19999999999999},{"$f":"$AE21*U21","v":331.1},{"$f":"$AE21*V21","v":158.69999999999999},{"$f":"$AE21*W21","v":5.8},{"$f":"$AE21*X21","v":6.27},{"$f":"$AE21*Y21","v":13.04},{"$f":"$AE21*Z21","v":6.25},{"$f":"$AE21*AA21","v":12.8}]
[1055,"230-400-460/480 Vac -15÷10% 3Ph","50/60 ± 5%",17,16,15,"<35 %",13.5,12.2,5.4,9.4,10.1,3,5.5,7.5,"200% * 10Sec with output frequency more than 3Hz   150% with output frequency less than 3Hz","0,98 * Uln (AC Imput Voltage)",300,10,159.19999999999999,331.1,158.69999999999999,5.8,6.27,13.04,6.25,12.8,null,5.5,1,false,0,0,0,0,0,0,0,0,0,0,0,0,0,0,0,0,0,0,0,0,0,0]
[2075,"230-400-460/480 Vac -15÷10% 3Ph","50/60 ± 5%",23,22,20,"<35 %",18.5,16.7,7.4,12.8,13.9,4,7.5,10,"200% * 10Sec with output frequency more than 3Hz   150% with output frequency less than 3Hz","0,98 * Uln (AC Imput Voltage)",300,10,159.19999999999999,382.1,158.6,7.8,6.27,15.04,6.24,17.2,null,7.5,1,false,0,0,0,0,0,0,0,0,0,0,0,0,0,0,0,0,0,0,0,0,0,0]
[2110,"230-400-460/480 Vac -15÷10% 3Ph","50/60 ± 5%",31,25,26,"<35 %",24.5,22,9.8000000000000007,17.100000000000001,18.3,5.5,11,15,"200% * 10Sec with output frequency more than 3Hz   150% with output frequency less than 3Hz","0,98 * Uln (AC Imput Voltage)",300,10,159.19999999999999,382.1,158.6,7.8,6.27,15.04,6.24,17.2,null,{"$f":"IF($AC$2<370,M24,IF($AC$2>=370,N24,0))","v":11},1,false,0,0,0,0,0,0,0,0,0,0,0,0,0,0,0,0,0,0,0,0,0,0]
[3150,"230-400-460/480 Vac -15÷10% 3Ph","50/60 ± 5%",42,40,37,"<35 %",32,28.8,12.8,22.2,24,7.5,15,20,"200% * 10Sec with output frequency more than 3Hz   150% with output frequency less than 3Hz","0,98 * Uln (AC Imput Voltage)",300,10,227.8,387,178,10.5,8.9700000000000006,15.24,7.01,23.15,null,{"$f":"IF($AC$2<370,M25,IF($AC$2>=370,N25,0))","v":15},1,false,0,0,0,0,0,0,0,0,0,0,0,0,0,0,0,0,0,0,0,0,0,0]
[3185,"230-400-460/480 Vac -15÷10% 3Ph","50/60 ± 5%",50,47,45,"<35 %",39,35.1,15.6,27.1,29.2,11,18.5,25,"200% * 10Sec with output frequency more than 3Hz   150% with output frequency less than 3Hz","0,98 * Uln (AC Imput Voltage)",300,10,227.8,387,178,10.5,8.9700000000000006,15.24,7.01,23.15,null,18.5,1,false,0,0,0,0,0,0,0,0,0,0,0,0,0,0,0,0,0,0,0,0,0,0]
[3220,"230-400-460/480 Vac -15÷10% 3Ph","50/60 ± 5%",55,53,50,"<35 %",45,40.5,17.899999999999999,31.2,33.700000000000003,11,22,30,"200% * 10Sec with output frequency more than 3Hz   150% with output frequency less than 3Hz","0,98 * Uln (AC Imput Voltage)",300,10,227.8,387,178,10.5,8.9700000000000006,15.24,7.01,23.15,null,22,1,false,0,0,0,0,0,0,0,0,0,0,0,0,0,0,0,0,0,0,0,0,0,0]
[4300,"230-400-460/480 Vac -15÷10% 3Ph","50/60 ± 5%",55,55,49,"<35 %",60,54,23.9,41.6,44.9,15,30,40,"200% * 10Sec with output frequency more than 3Hz   150% with output frequency less than 3Hz","0,98 * Uln (AC Imput Voltage)",300,10,268,612,275,32,10.55,24.09,10.87,70.599999999999994,null,30,1,false,0,0,0,0,0,0,0,0,0,0,0,0,0,0,0,0,0,0,0,0,0,0]
[4370,"230-400-460/480 Vac -15÷10% 3Ph","50/60 ± 5%",72,72,65,"<35 %",75,67.5,29.9,52,56.1,18.5,37,50,"200% * 10Sec with output frequency more than 3Hz   150% with output frequency less than 3Hz","0,98 * Uln (AC Imput Voltage)",300,10,268,612,275,32,10.55,24.09,10.87,70.599999999999994,null,37,1,false,0,0,0,0,0,0,0,0,0,0,0,0,0,0,0,0,0,0,0,0,0,0]
[4450,"230-400-460/480 Vac -15÷10% 3Ph","50/60 ± 5%",89,89,81,"<35 %",90,81,35.799999999999997,62.3,67.3,22,45,60,"200% * 10Sec with output frequency more than 3Hz   150% with output frequency less than 3Hz","0,98 * Uln (AC Imput Voltage)",300,10,268,612,275,32,10.55,24.09,10.87,70.599999999999994,null,45,1,false,0,0,0,0,0,0,0,0,0,0,0,0,0,0,0,0,0,0,0,0,0,0]
[5550,"230-400-460/480 Vac -15÷10% 3Ph","50/60 ± 5%",97,97,89,"<35 %",105,94,41.8,72.7,78.599999999999994,30,55,75,"200% * 10Sec with output frequency more than 3Hz   150% with output frequency less than 3Hz","0,98 * Uln (AC Imput Voltage)",300,10,311,767,331,60,12,30.2,13.03,132.30000000000001,null,55,1,false,0,0,0,0,0,0,0,0,0,0,0,0,0,0,0,0,0,0,0,0,0,0]
[5750,"230-400-460/480 Vac -15÷10% 3Ph","50/60 ± 5%",136,136,122,"<35 %",150,135,51.8,104,112.2,37,75,100,"200% * 10Sec with output frequency more than 3Hz   150% with output frequency less than 3Hz","0,98 * Uln (AC Imput Voltage)",300,10,311,767,331,60,12,30.2,13.03,132.30000000000001,null,75,{"$f":"IF($AD$2<=AC32,1,0)","v":1},false,0,0,0,0,0,0,0,0,0,0,0,0,0,0,0,0,0,0,0,0,0,0]
["AVRy",null,null,null,null,null,null,null,null,null,null,null,null,null,null,null,null,null,null,null,null,null,null,null,null,null,null,null,null,null,null,{"$f":"SUM(AF21:AF32)","v":1040},{"$f":"SUM(AG21:AG32)","v":12},11,10,9,8.1,3.6,6.8,6.7,2,4,5,{"$f":"SUM(AR21:AR32)","v":300},10,159.19999999999999,331.1,158.69999999999999,5.8,6.27,13.04,6.25,12.8]
[null,null,"KVA","fsw","At 400 V","At 480 V",null,null,null,null,null,null,null,null,null,null,null,null,null,null,null,null,null,null,null,null,null,null,"Prif"]
[1425,null,13,16,18,16,"<4%",14,null,null,9.6999999999999993,11.7,null,7.5,11,25,520,300,8,350,670,150.30000000000001,28.7,13.8,26.4,5.9,63.27,null,{"$f":"IF($AC$2<=480,N35,O35)","v":7.5},{"$f":"IF($AD$2<=AC35,1,0)","v":1},true,1425,null,{"$f":"$AE35*C35","v":13},16,{"$f":"$AE35*E35","v":18},{"$f":"$AE35*F35","v":16},{"$f":"$AE35*K35","v":9.6999999999999993},11.7,{"$f":"AE35*H35","v":14},{"$f":"$AE35*P35","v":25},520,null,{"$f":"$AE35*R35","v":300},{"$f":"$AE35*S35","v":8},{"$f":"$AE35*T35","v":350},{"$f":"$AE35*U35","v":670},{"$f":"$AE35*V35","v":150.30000000000001},{"$f":"$AE35*W35","v":28.7},{"$f":"$AE35*X35","v":13.8},{"$f":"$AE35*Y35","v":26.4},{"$f":"$AE35*Z35","v":5.9},{"$f":"$AE35*AA35","v":63.27}]
[2545,null,22,8,32,26,"<4%",25,null,null,17.3,20.8,null,14,17,45,520,300,8,350,670,150.30000000000001,32,13.8,26.4,5.9,70.55,null,{"$f":"IF($AC$2<=480,N36,O36)","v":14},{"$f":"IF($AD$2<=AC36,1,0)","v":1},false,0,null,0,{"$f":"$AE36*D36","v":0},{"$f":"$AE36*E36","v":0},0,0,0,{"$f":"AE36*H36","v":0},0,0,null,0,0,0,0,0,0,0,0,0,0]
[3360,null,29,8,42,35,"<4%",33,null,null,23,27.4,null,17,27,60,520,300,8,420,788,181.2,48,16.5,31,7.1,105.8,null,{"$f":"IF($AC$2<=480,N37,O37)","v":17},{"$f":"IF($AD$2<=AC37,1,0)","v":1},false,0,null,0,0,0,0,0,0,{"$f":"AE37*H37","v":0},0,0,null,0,0,0,0,0,0,0,0,0,0]
["AGL50",null,null,null,null,null,null,null,null,null,null,null,null,null,null,null,null,null,null,null,null,null,null,null,null,null,null,null,null,null,null,{"$f":"SUM(AF35:AF37)","v":1425},null,{"$f":"SUM(AH35:AH37)","v":13},16,18,16,9.6999999999999993,11.7,14,25,520,null,300,8,350,670,150.30000000000001,28.7,13.8,26.4,5.9,63.27]
[null,null,null,null,"con L","Senza L"]
[2040,null,null,null,9,11,null,10.1,null,null,7,null,null,4,null,17.2,null,500,8,130,221,176.5,3,5.13,8.7100000000000009,6.96,6.6,null,4,{"$f":"IF($AD$2<=AC40,1,0)","v":1},true,2040,null,{"$f":"$AE40*E40","v":9},11,{"$f":"$AE40*H40","v":10.1},null,null,{"$f":"$AE40*K40","v":7},{"$f":"$AE40*N40","v":4},null,{"$f":"$AE40*P40","v":17.2},null,{"$f":"$AE40*R40","v":500},8,130,221,176.5,3,5.13,8.7100000000000009,6.96,6.6]
[2055,null,null,null,13,14,null,13,null,null,9,null,null,5.5,null,22.1,null,500,8,130,221,176.5,3,5.13,8.7100000000000009,6.96,6.6,null,5.5,{"$f":"IF($AD$2<=AC41,1,0)","v":1},false,0,null,0,0,{"$f":"$AE41*H41","v":0},null,null,{"$f":"$AE41*K41","v":0},{"$f":"$AE41*N41","v":0},null,{"$f":"$AE41*P41","v":0},null,0,0,0,0,0,0,0,0,0,0]
[2075,null,null,null,16,19,null,17.7,null,null,12.3,null,null,7.5,null,30,null,500,8,130,221,176.5,3,5.13,8.7100000000000009,6.96,6.6,null,7.5,{"$f":"IF($AD$2<=AC42,1,0)","v":1},false,0,null,0,0,{"$f":"$AE42*H42","v":0},null,null,{"$f":"$AE42*K42","v":0},{"$f":"$AE42*N42","v":0},null,{"$f":"$AE42*P42","v":0},null,0,0,0,0,0,0,0,0,0,0]
[null,null,null,null,null,null,null,null,null,null,null,null,null,null,null,null,null,null,null,null,null,null,null,null,null,null,null,null,null,null,null,{"$f":"SUM(AF40:AF42)","v":2040},null,{"$f":"SUM(AH40:AH42)","v":9},11,10.1,null,null,7,4,null,17.2,null,500,8,130,221,176.5,3,5.13,8.7100000000000009,6.96,6.6]
[]
[]
[]
[]
[null,"Resistenze"]
[null,"AGL50",null,null,null,null,null,null,{"$f":"IF(Foglio1!G21>=230,Foglio1!BC69,Foglio1!AF64)","v":1040}]
[null,null,null,null,null,null,null,null,"Scelta"]
[2040,200,100,0.75,400,null,null,{"$f":"IF($I$49=A51,1,0)","v":0},{"$f":"Foglio1!$Z$32","v":0},{"$f":"I51*H51","v":0},null,{"$f":"B51*$J51","v":0},0,0,0,0,0]
[2055,300,68,0.55000000000000004,550,null,null,{"$f":"IF($I$49=A52,1,0)","v":0},{"$f":"Foglio1!$Z$32","v":0},{"$f":"I52*H52","v":0},null,{"$f":"B52*$J52","v":0},{"$f":"C52*$J52","v":0},{"$f":"D52*$J52","v":0},{"$f":"E52*$J52","v":0},{"$f":"F52*$J52","v":0},{"$f":"G52*$J52","v":0}]
[2075,400,68,0.4,750,null,null,0,{"$f":"Foglio1!$Z$32","v":0},0,null,0,0,0,0,0,0]
[null,"ADL100"]
[1040,1040,7.5,38,750,100,44,1,{"$f":"IF(Foglio1!$G$21>=230,Foglio1!$Z$31,0)","v":0},0,null,0,0,0,0,0,0]
[1055,1055,7.5,38,750,68,44,0,{"$f":"IF(Foglio1!$G$21>=230,Foglio1!$Z$31,0)","v":0},0,null,0,0,0,0,0,0]
[2075,2075,7.5,28,750,68,44,0,{"$f":"IF(Foglio1!$G$21>=230,Foglio1!$Z$31,0)","v":0},0,null,0,0,0,0,0,0]
[2110,2110,7.5,28,1200,49,44,0,{"$f":"IF(Foglio1!$G$21>=230,Foglio1!$Z$31,0)","v":0},0,null,0,0,0,0,0,0]
[3150,3150,12,43,1900,28,44,0,{"$f":"IF(Foglio1!$G$21>=230,Foglio1!$Z$31,0)","v":0},0,null,0,0,0,0,0,0]
[3185,3185,40,150,4000,15.4,20,0,{"$f":"IF(Foglio1!$G$21>=230,Foglio1!$Z$31,0)","v":0},0,null,0,0,0,0,0,0]
[3220,3220,40,150,4000,15.4,20,0,{"$f":"IF(Foglio1!$G$21>=230,Foglio1!$Z$31,0)","v":0},0,null,0,0,0,0,0,0]
["ADL200"]
[]
[]
[1040,1040,7.5,38,750,100,44,1,{"$f":"IF(Foglio1!$G$21>=230,Foglio1!$Z$30,Foglio1!$Z$31)","v":1},1,null,1040,7.5,38,750,100,44]
[1055,1055,7.5,38,750,68,44,0,{"$f":"IF(Foglio1!$G$21>=230,Foglio1!$Z$30,Foglio1!$Z$31)","v":1},0,null,0,0,0,0,0,0]
[2075,2075,7.5,28,750,68,44,0,{"$f":"IF(Foglio1!$G$21>=230,Foglio1!$Z$30,Foglio1!$Z$31)","v":1},0,null,0,0,0,0,0,0]
[2110,2110,7.5,28,1200,49,44,0,{"$f":"IF(Foglio1!$G$21>=230,Foglio1!$Z$30,Foglio1!$Z$31)","v":1},0,null,0,0,0,0,0,0]
[3150,3150,12,43,1900,28,44,0,{"$f":"IF(Foglio1!$G$21>=230,Foglio1!$Z$30,Foglio1!$Z$31)","v":1},0,null,0,0,0,0,0,0]
[3185,3185,40,150,4000,15.4,20,0,{"$f":"IF(Foglio1!$G$21>=230,Foglio1!$Z$30,Foglio1!$Z$31)","v":1},0,null,0,0,0,0,0,0]
[3220,3220,40,150,4000,15.4,20,0,{"$f":"IF(Foglio1!$G$21>=230,Foglio1!$Z$30,Foglio1!$Z$31)","v":1},0,null,0,0,0,0,0,0]
[4300,4300,40,150,4000,11.6,20,{"$f":"IF($I$49=A72,1,0)","v":0},{"$f":"IF(Foglio1!$G$21>=230,Foglio1!$Z$30,Foglio1!$Z$31)","v":1},{"$f":"I72*H72","v":0},null,0,0,0,0,0,0]
[4370,4370,40,150,4000,11.6,20,0,{"$f":"IF(Foglio1!$G$21>=230,Foglio1!$Z$30,Foglio1!$Z$31)","v":1},0,null,0,0,0,0,0,0]
[4450,4450,40,150,8000,7.7,20,0,{"$f":"IF(Foglio1!$G$21>=230,Foglio1!$Z$30,Foglio1!$Z$31)","v":1},0,null,0,0,0,0,0,0]
[5550,5550,40,150,8000,7.7,20,0,{"$f":"IF(Foglio1!$G$21>=230,Foglio1!$Z$30,Foglio1!$Z$31)","v":1},0,null,0,0,0,0,0,0]
[5750,5750,null,null,null,null,null,null,null,null,null,{"$f":"SUM(L51:L75)","v":1040},7.5,38,750,100,44]
[]
[]
[]
["ADL130"]
[1011,null,2200,16,6,1.1000000000000001,null,159.19999999999999,331.1,150.69999999999999,5,6.27,13.04,6.25,12.8,null,null,null,null,null,null,null,null,null,null,null,null,null,null,{"$f":"IF($AD$2<=F81,1,0)","v":0},{"$f":"AND(AD80=0,AD81=1)","v":false},{"$f":"A81*$AE81","v":0},{"$f":"C81*$AE81","v":0},0,0,0,{"$f":"H81*$AE81","v":0},0,0,0,0,0,0,0]
[1015,null,2200,18,6.8,1.5,null,159.19999999999999,331.1,150.69999999999999,5,6.27,13.04,6.25,12.8,null,null,null,null,null,null,null,null,null,null,null,null,null,null,0,false,0,0,0,0,0,0,0,0,0,0,0,0,0]
[2022,null,4050,24,9.6,2.2000000000000002,null,159.19999999999999,382.1,150.69999999999999,7.8,6.27,15.04,6.25,17.2,null,null,null,null,null,null,null,null,null,null,null,null,null,null,0,false,0,0,0,0,0,0,0,0,0,0,0,0,0]
[2030,null,4050,31,13,3,null,159.19999999999999,382.1,150.69999999999999,7.8,6.27,15.04,6.25,17.2,null,null,null,null,null,null,null,null,null,null,null,null,null,null,0,false,0,0,0,0,0,0,0,0,0,0,0,0,0]
[3040,null,4950,36,15,4,null,227.8,307,178,10.5,8.9700000000000006,15.24,7.01,23.15,null,null,null,null,null,null,null,null,null,null,null,null,null,null,1,true,3040,4950,36,15,4,227.8,307,178,10.5,8.9700000000000006,15.24,7.01,23.15]
[3055,null,4950,50,22,5.5,null,227.8,307,178,10.5,8.9700000000000006,15.24,7.01,23.15,null,null,null,null,null,null,null,null,null,null,null,null,null,null,1,false,0,0,0,0,0,0,0,0,0,0,0,0,0]
[null,null,null,null,null,null,null,null,null,null,null,null,null,null,null,null,null,null,null,null,null,null,null,null,null,null,null,null,null,null,null,{"$f":"SUM(AF81:AF86)","v":3040},{"$f":"SUM(AG81:AG86)","v":4950},36,15,4,227.8,307,178,10.5,8.9700000000000006,15.24,7.01,23.15]

{"sheet":"Foglio3","index":2,"n_rows":219,"n_cols":98,"rows_kept":219,"cut":false,"hidden":false,"merged":[[166,0,166,6],[1,0,1,1],[1,2,1,3],[1,4,1,5],[20,0,20,8],[38,0,38,9],[1,6,1,7],[1,8,1,9],[115,1,115,9],[143,0,143,5],[82,1,82,18],[1,16,1,17],[1,10,1,11],[1,12,1,13],[1,14,1,15],[2,0,2,18],[0,1,0,18],[60,0,60,9],[1,25,1,26],[1,19,1,20],[1,21,1,22],[1,23,1,24]]}
[null,null,null,null,null,null,null,null,null,null,null,null,null,null,null,null,null,null,null,null,"omega",null,{"$f":"3000*2*PI()/60","v":314.15926535897933},null,null,null,null,"prif",{"$f":"Foglio1!U43","v":3.4212374999999997}]
["Pn",null,"Giri",null,"Efficienza",null,"cosfi",null,"In",null,"Is/In",null,"Cn",null,"Cs/Cn",null,"Cmax/Cn",null,"J","Rr",null,"Z",null,"Rs",null,"Sn",null,null,null,"Pn","Vel","Eff.","Cosfi","In","Cn","J","Rr","Rs","Z"]
["Asincroni Trifase"]
[null,1.1000000000000001,null,2850,null,81.400000000000006,null,0.85,null,2.2999999999999998,null,8.1,null,3.69,null,3.2,null,3.5,1.093E-3,null,{"$f":"3*400^2/$W$1*(3000-D4)/3000/N4","v":20.70308202821403},null,{"$f":"SQRT(3*400^2*U4/($W$1*N4*P4))","v":51.757705070535074},null,{"$f":"(3*400^2-N4*R4*2*$W$1*W4)/(2*$W$1*N4*R4)","v":7.3939578672192958},null,{"$f":"(3000-D4)/3000","v":0.05},{"$f":"IF(B4<$AC$1,0,1)","v":0},{"$f":"AND(AB4=1,AB2=0)","v":false},{"$f":"$AC4*B4","v":0},{"$f":"$AC4*D4","v":0},{"$f":"$AC4*F4","v":0},{"$f":"$AC4*H4","v":0},{"$f":"$AC4*J4","v":0},{"$f":"$AC4*N4","v":0},{"$f":"$AC4*S4","v":0},{"$f":"AC4*U4","v":0},{"$f":"AC4*Y4","v":0},{"$f":"AC4*W4","v":0}]
[null,1.5,null,2900,null,85.9,null,0.87,null,3,null,7.7,null,5,null,2.7,null,3.6,2.3999999999999998E-3,null,{"$f":"3*400^2/$W$1*(3000-D5)/3000/N5","v":10.185916357881302},null,{"$f":"SQRT(3*400^2*U5/($W$1*N5*P5))","v":33.953054526271004},null,{"$f":"(3*400^2-N5*R5*2*$W$1*W5)/(2*$W$1*N5*R5)","v":8.4882636315677562},null,{"$f":"(3000-D5)/3000","v":3.3333333333333333E-2},{"$f":"IF(B5<$AC$1,0,1)","v":0},{"$f":"AND(AB5=1,AB4=0)","v":false},{"$f":"$AC5*B5","v":0},{"$f":"$AC5*D5","v":0},{"$f":"$AC5*F5","v":0},{"$f":"$AC5*H5","v":0},{"$f":"$AC5*J5","v":0},0,0,{"$f":"AC5*U5","v":0},{"$f":"AC5*Y5","v":0},{"$f":"AC5*W5","v":0}]
[null,2.2000000000000002,null,2880,null,85.8,null,0.87,null,4.4000000000000004,null,7.4,null,7.3,null,3,null,3.6,2.7000000000000001E-3,null,8.3719860475736709,null,24.167841991092253,null,4.9015540074274409,null,0.04,0,false,0,0,0,0,0,0,0,0,0,0]
[null,3,null,2920,null,87.6,null,0.86,null,5.9,null,10,null,9.9,null,3.9,null,4.9000000000000004,5.0000000000000001E-3,null,4.1155217607601209,null,12.761691232299839,null,2.9864787706087883,null,2.6666666666666668E-2,0,false,0,0,0,0,0,0,0,0,0,0]
[null,4,null,2860,null,87.7,null,0.93,null,7.1,null,7.9,null,13.4,null,2.7,null,3.1,1.2E-2,null,5.3210010824753065,null,14.990222347563492,null,3.4003343891023139,null,4.6666666666666669E-2,1,true,4,2860,87.7,0.93,7.1,13.4,1.2E-2,5.3210010824753065,3.4003343891023139,14.990222347563492]
[null,5.5,null,2900,null,88.6,null,0.88,null,10.1,null,9,null,18.100000000000001,null,3.8,null,4.5999999999999996,1.6E-2,null,2.8137890491384812,null,7.9060647006211422,null,1.2693343726565129,null,3.3333333333333333E-2,1,false,0,0,0,0,0,0,0,0,0,0]
[null,7.5,null,2915,null,90.9,null,0.9,null,13.3,null,11,null,24.6,null,5.0999999999999996,null,5.2,2.1999999999999999E-2,null,1.7597619723981923,null,4.6293498758840785,null,1.3426930168699671,null,2.8333333333333332E-2,1,false,0,0,0,0,0,0,0,0,0,0]
[null,11,null,2930,null,91.2,null,0.88,null,20,null,6.3,null,36,null,1.9,null,2.5,3.9E-2,null,0.9902974236829043,null,4.7032759036662384,null,3.7849877279015129,null,2.3333333333333334E-2,1,false,0,0,0,0,0,0,0,0,0,0]
[null,15,null,2920,null,91.7,null,0.9,null,26.5,null,6.6,null,49,null,2.2999999999999998,null,2.5,4.7E-2,null,0.8315033761535755,null,3.3574977691601124,null,2.8787775519917052,null,2.6666666666666668E-2,1,false,0,0,0,0,0,0,0,0,0,0]
[null,18.5,null,2920,null,92.4,null,0.91,null,32,null,7.3,null,60,null,2.6,null,2.7,5.2999999999999999E-2,null,0.67906109052542007,null,2.578919621361969,null,2.1367823961756707,null,2.6666666666666668E-2,1,false,0,0,0,0,0,0,0,0,0,0]
[null,22,null,2930,null,92.8,null,0.89,null,38.5,null,7.2,null,71,null,2.5,null,2.7,7.6999999999999999E-2,null,0.50212263736034579,null,2.078985231651151,null,1.9061150648595302,null,2.3333333333333334E-2,1,false,0,0,0,0,0,0,0,0,0,0]
[null,30,null,2955,null,93.2,null,0.88,null,53,null,7.3,null,97,null,2.4,null,3.1,0.15,null,0.2362712557240508,null,1.2452588561934936,null,1.2952922806242568,null,1.4999999999999999E-2,1,false,0,0,0,0,0,0,0,0,0,0]
[null,37,null,2950,null,93.6,null,0.89,null,64,null,7.3,null,120,null,2.5,null,3.2,0.18,null,0.21220659078919379,null,1.0395957349782348,null,0.94984105367045701,null,1.6666666666666666E-2,1,false,0,0,0,0,0,0,0,0,0,0]
[null,45,null,2960,null,93.9,null,0.88,null,79,null,7.3,null,145,null,2.5,null,2.8,0.26,null,0.14049539803974206,null,0.76952498732033836,null,1.1121098078547791,null,1.3333333333333334E-2,1,false,0,0,0,0,0,0,0,0,0,0]
[null,55,null,2970,null,94.4,null,0.89,null,95,null,7.4,null,177,null,1.7,null,2.7,0.49,null,8.6321325066790675E-2,null,0.66205434117141349,null,0.93648871562100655,null,0.01,1,false,0,0,0,0,0,0,0,0,0,0]
[null,75,null,2970,null,94.7,null,0.9,null,127,null,8.1999999999999993,null,241,null,2.6,null,3.2,0.56999999999999995,null,6.3397819654862866E-2,null,0.39317658672127093,null,0.59741434538596139,null,0.01,1,false,0,0,0,0,0,0,0,0,0,0]
[null,90,null,2970,null,95.4,null,0.9,null,152,null,8.3000000000000007,null,290,null,2.7,null,3.4,0.59,null,5.2685774264903278E-2,null,0.32063541138347429,null,0.45415538662980931,null,0.01,1,false,0,0,0,0,0,0,0,0,0,0]
[1500,null,null,null,null,null,null,null,null,null,null,null,null,null,null,null,null,null,null,null,"omega",null,{"$f":"1500*2*PI()/60","v":157.07963267948966},null,null,null,null,null,null,{"$f":"SUM(AD4:AD20)","v":4},{"$f":"SUM(AE4:AE20)","v":2860},87.7,0.93,7.1,13.4,1.2E-2,5.3210010824753065,3.4003343891023139,14.990222347563492]
[null,1.1000000000000001,null,1420,null,83.9,null,0.8,null,2.4,null,6.1,null,7.4,null,2.9,null,3.4,4.3E-3,null,{"$f":"3*400^2/$W$21*(1500-D22)/1500/N22","v":22.023602935959566},null,{"$f":"SQRT(3*400^2*U22/($W$21*N22*P22))","v":56.000255134163666},null,{"$f":"(3*400^2-N22*R22*2*$W$21*W22)/(2*$W$21*N22*R22)","v":4.7265911966072096},null,{"$f":"(1500-D22)/1500","v":5.3333333333333337E-2},0,false,{"$f":"$AC22*B22","v":0},{"$f":"$AC22*D22","v":0},{"$f":"$AC22*F22","v":0},{"$f":"$AC22*H22","v":0},{"$f":"$AC22*J22","v":0},{"$f":"$AC22*N22","v":0},{"$f":"$AC22*S22","v":0},0,0,0]
[null,1.5,null,1440,null,85.6,null,0.82,null,3.2,null,6.9,null,10,null,2.8,null,3.4,6.8999999999999999E-3,null,{"$f":"3*400^2/$W$21*(1500-D23)/1500/N23","v":12.223099629457561},null,{"$f":"SQRT(3*400^2*U23/($W$21*N23*P23))","v":36.523495929680763},null,{"$f":"(3*400^2-N23*R23*2*$W$21*W23)/(2*$W$21*N23*R23)","v":8.414370355089682},null,{"$f":"(1500-D23)/1500","v":0.04},0,false,0,0,0,0,0,0,0,0,0,0]
[null,2.2000000000000002,null,1450,null,86.8,null,0.77,null,4.8,null,8.5,null,14.5,null,4,null,4.5999999999999996,8.9999999999999993E-3,null,7.0247699019871055,null,19.238124683008461,null,3.6687336930364465,null,3.3333333333333333E-2,0,false,0,0,0,0,0,0,0,0,0,0]
[null,3,null,1455,null,87.5,null,0.81,null,6.2,null,7.9,null,19.7,null,2.7,null,3.7,1.7999999999999999E-2,null,4.6534643259356203,null,16.350606978107464,null,4.610944039620553,null,0.03,0,false,0,0,0,0,0,0,0,0,0,0]
[null,4,null,1455,null,89.3,null,0.76,null,8.6,null,8.5,null,26.3,null,3,null,4.0999999999999996,1.7999999999999999E-2,null,3.4856747992749701,null,11.618915997583233,null,2.550493755567051,null,0.03,1,true,4,1455,89.3,0.76,8.6,26.3,1.7999999999999999E-2,3.4856747992749701,2.550493755567051,11.618915997583233]
[null,5.5,null,1460,null,89.3,null,0.84,null,10.6,null,7.6,null,36,null,2.2000000000000002,null,3.4,3.7999999999999999E-2,null,2.2635369684180668,null,9.3452706871959847,null,3.1374699474624737,null,2.6666666666666668E-2,1,false,0,0,0,0,0,0,0,0,0,0]
[null,7.5,null,1450,null,90.1,null,0.87,null,14,null,8.5,null,49,null,3.3,null,3.2,4.8000000000000001E-2,null,2.0787584403839392,null,6.2676925241253638,null,3.4764876651743499,null,3.3333333333333333E-2,1,false,0,0,0,0,0,0,0,0,0,0]
[null,11,null,1465,null,91.5,null,0.83,null,21,null,7.9,null,72,null,3.4,null,3.4,9.0999999999999998E-2,null,0.9902974236829043,null,3.5159103929144973,null,2.7254599244147322,null,2.3333333333333334E-2,1,false,0,0,0,0,0,0,0,0,0,0]
[null,15,null,1455,null,91.8,null,0.84,null,28.5,null,9.6,null,98,null,2.9,null,3.2,0.10199999999999999,null,0.93544129817277255,null,3.1714430203531467,null,1.7006470742967101,null,0.03,1,false,0,0,0,0,0,0,0,0,0,0]
[null,18.5,null,1470,null,92.3,null,0.84,null,35,null,7,null,120,null,3.1,null,2.7,0.161,null,0.50929581789406497,null,2.045381225308601,null,2.6703207922290382,null,0.02,1,false,0,0,0,0,0,0,0,0,0,0]
[null,22,null,1470,null,93.1,null,0.85,null,40,null,8.5,null,143,null,3.6,null,2.9,0.22500000000000001,null,0.42738110592508954,null,1.592755341912564,null,2.091564536752001,null,0.02,1,false,0,0,0,0,0,0,0,0,0,0]
[null,30,null,1475,null,93.4,null,0.84,null,55,null,7,null,194,null,2.5,null,2.8,0.34,null,0.26252361747116759,null,1.2860978164679195,null,1.5266552278660188,null,1.6666666666666666E-2,1,false,0,0,0,0,0,0,0,0,0,0]
[null,37,null,1480,null,93.6,null,0.84,null,68,null,6.6,null,239,null,2.4,null,2.5,0.37,null,0.17047558757960335,null,0.95298750583052994,null,1.6041463078635205,null,1.3333333333333334E-2,1,false,0,0,0,0,0,0,0,0,0,0]
[null,45,null,1480,null,94.2,null,0.83,null,83,null,6.7,null,290,null,2.7,null,2.6,0.42,null,0.14049539803974206,null,0.74047576429590112,null,1.2859001689696097,null,1.3333333333333334E-2,1,false,0,0,0,0,0,0,0,0,0,0]
[null,55,null,1480,null,94.6,null,0.86,null,98,null,7.5,null,355,null,2.2999999999999998,null,2.8,0.72,null,0.11477088853950761,null,0.6553879581926717,null,0.88172215617573391,null,1.3333333333333334E-2,1,false,0,0,0,0,0,0,0,0,0,0]
[null,75,null,1480,null,94.8,null,0.86,null,132,null,7.1,null,486,null,3.4,null,3.5,0.88,null,8.3834702534002478E-2,null,0.39374495372017571,null,0.50448400200127941,null,1.3333333333333334E-2,1,false,0,0,0,0,0,0,0,0,0,0]
[null,90,null,1475,null,95,null,0.88,null,157,null,7.7,null,583,null,5,null,3.2,0.95,null,{"$f":"3*400^2/$W$21*(1500-D38)/1500/N38","v":8.7357773223681837E-2},null,0.30261620331899391,null,0.51636292065302325,null,1.6666666666666666E-2,1,false,0,0,0,0,0,0,0,0,0,0]
[1000,null,null,null,null,null,null,null,null,null,null,null,null,null,null,null,null,null,null,null,"omega",null,{"$f":"1000*2*PI()/60","v":104.71975511965977},null,null,null,null,null,null,{"$f":"SUM(AD22:AD38)","v":4},{"$f":"SUM(AE22:AE38)","v":1455},89.3,0.76,8.6,26.3,1.7999999999999999E-2,3.4856747992749701,2.550493755567051,11.618915997583233]
[null,0.09,null,910,null,47.1,null,0.56000000000000005,null,0.51,null,2.1,null,0.95,null,2.1,null,2.1,2.0000000000000001E-4,null,{"$f":"3*400^2/$W$39*(1000-D40)/1000/N40","v":434.24169736230817},null,{"$f":"SQRT(3*400^2*U40/($W$39*N40*P40))","v":998.85079926698154},null,{"$f":"(3*400^2-N40*R40*2*$W$39*W40)/(2*$W$39*N40*R40)","v":149.93675989256388},null,{"$f":"(1000-D40)/1000","v":0.09},0,false,0,0,0,0,0,0,0,0,0,0]
[null,0.12,null,910,null,57.5,null,0.57999999999999996,null,0.54,null,2.1,null,1.27,null,2.1,null,2.1,2.7E-4,null,{"$f":"3*400^2/$W$39*(1000-D41)/1000/N41","v":324.82646653086044},null,{"$f":"SQRT(3*400^2*U41/($W$39*N41*P41))","v":747.1718577193958},null,{"$f":"(3*400^2-N41*R41*2*$W$39*W41)/(2*$W$39*N41*R41)","v":112.1574188172719},null,{"$f":"(1000-D41)/1000","v":0.09},0,false,0,0,0,0,0,0,0,0,0,0]
[null,0.18,null,920,null,61.1,null,0.69,null,0.64,null,2.9,null,1.88,null,2.1,null,2.2000000000000002,6.3000000000000003E-4,null,195.04946217219515,null,475.87196090604357,null,78.245829355874477,null,0.08,0,false,0,0,0,0,0,0,0,0,0,0]
[null,0.25,null,920,null,64.900000000000006,null,0.65,null,0.86,null,3.2,null,2.61,null,2.5,null,2.7,8.0999999999999996E-4,null,140.4953980397421,null,314.15726054275405,null,11.063568252945284,null,0.08,0,false,0,0,0,0,0,0,0,0,0,0]
[null,0.37,null,925,null,72.900000000000006,null,0.72,null,1.04,null,3.8,null,3.82,null,3.1,null,3.4,1.8420000000000001E-3,null,89.993370962956533,null,186.63755706908321,null,-10.179966945639022,null,7.4999999999999997E-2,0,false,0,0,0,0,0,0,0,0,0,0]
[null,0.55000000000000004,null,925,null,73.3,null,0.71,null,1.55,null,3.4,null,5.68,null,2.9,null,3.1,2.176E-3,null,60.523710753255976,null,129.77645790692554,null,0.38205984201203957,null,7.4999999999999997E-2,0,false,0,0,0,0,0,0,0,0,0,0]
[null,0.75,null,930,null,71.5,null,0.67,null,2.36,null,4,null,7.5,null,1.9,null,2.2999999999999998,3.2000000000000002E-3,null,42.780848703101469,null,117.30690471116664,null,15.552873869893824,null,7.0000000000000007E-2,0,false,0,0,0,0,0,0,0,0,0,0]
[null,1.1000000000000001,null,930,null,74.400000000000006,null,0.69,null,3.25,null,4,null,11,null,2.1,null,2.4,4.3E-3,null,29.168760479387366,null,76.078038519169823,null,10.733748621864006,null,7.0000000000000007E-2,0,false,0,0,0,0,0,0,0,0,0,0]
[null,1.5,null,950,null,80,null,0.71,null,3.92,null,4.5,null,15,null,1.9,null,2.2999999999999998,8.2000000000000007E-3,null,15.278874536821952,null,49.571214812837567,null,16.85867447769267,null,0.05,0,false,0,0,0,0,0,0,0,0,0,0]
[null,2.2000000000000002,null,940,null,80.5,null,0.74,null,5.4,null,5.6,null,22,null,2.1,null,2.7,1.4999999999999999E-2,null,12.50089734830887,null,35.21728860615891,null,3.365727900967233,null,0.06,0,false,0,0,0,0,0,0,0,0,0,0]
[null,3,null,960,null,84.5,null,0.75,null,6.9,null,6.5,null,30,null,2.1,null,3,3.1E-2,null,6.1115498147287806,null,21.086850206747386,null,4.3779406879558707,null,0.04,0,false,0,0,0,0,0,0,0,0,0,0]
[null,4,null,960,null,85.5,null,0.78,null,8.6999999999999993,null,7.1,null,40,null,2.6,null,2.8,3.7999999999999999E-2,null,4.5836623610465859,null,14.213333609973946,null,6.2494447875554586,null,0.04,1,true,4,960,85.5,0.78,8.6999999999999993,40,3.7999999999999999E-2,4.5836623610465859,6.2494447875554586,14.213333609973946]
[null,5.5,null,955,null,86,null,0.78,null,11.9,null,7,null,55,null,3,null,2.8,4.4999999999999998E-2,null,3.7502692044926613,null,10.20693994342267,null,4.6750807093259867,null,4.4999999999999998E-2,1,false,0,0,0,0,0,0,0,0,0,0]
[null,7.5,null,970,null,89.3,null,0.79,null,15.4,null,6.7,null,74,null,2,null,2.8,8.8999999999999996E-2,null,1.8582414977215886,null,7.5862391471384703,null,3.4747221488233682,null,0.03,1,false,0,0,0,0,0,0,0,0,0,0]
[null,11,null,970,null,89.8,null,0.78,null,23,null,7.1,null,109,null,2.2000000000000002,null,2.9,0.107,null,1.261558447994473,null,4.9106095988087342,null,2.3397263092054796,null,0.03,1,false,0,0,0,0,0,0,0,0,0,0]
[null,15,null,970,null,90.8,null,0.78,null,31,null,7,null,148,null,2.1,null,3,0.217,null,0.92912074886079432,null,3.7017056685487253,null,1.4600762695667993,null,0.03,1,false,0,0,0,0,0,0,0,0,0,0]
[null,18.5,null,985,null,91.1,null,0.81,null,36,null,7,null,179,null,2.5,null,2.7,0.37,null,0.38410578444524457,null,1.9835137417844908,null,2.7585329797617386,null,1.4999999999999999E-2,1,false,0,0,0,0,0,0,0,0,0,0]
[null,22,null,980,null,91.7,null,0.81,null,43,null,7.2,null,214,null,2.5,null,2.7,0.43,null,0.42837965991089588,null,1.9157720794780093,null,2.0507062530302855,null,0.02,1,false,0,0,0,0,0,0,0,0,0,0]
[null,30,null,985,null,92.8,null,0.83,null,56,null,6.6,null,291,null,2.5,null,2.7,0.64,null,0.2362712557240508,null,1.2200995181423502,null,1.6968295648706226,null,1.4999999999999999E-2,1,false,0,0,0,0,0,0,0,0,0,0]
[null,37,null,985,null,93.7,null,0.83,null,69,null,7.3,null,359,null,2.8,null,2.8,1.1599999999999999,null,0.19151792594902167,null,0.93451178952301017,null,1.3454635193939148,null,1.4999999999999999E-2,1,false,0,0,0,0,0,0,0,0,0,0]
[null,45,null,985,null,94.1,null,0.84,null,82,null,7.3,null,436,null,2.8,null,2.8,1.49,null,0.15769480599930913,null,0.76947186339165285,null,1.1078472556477419,null,1.4999999999999999E-2,1,false,0,0,0,0,0,0,0,0,0,0]
[750,null,null,null,null,null,null,null,null,null,null,null,null,null,null,null,null,null,null,null,"omega",null,{"$f":"750*2*PI()/60","v":78.539816339744831},null,null,null,null,null,null,{"$f":"SUM(AD40:AD60)","v":4},{"$f":"SUM(AE40:AE60)","v":960},85.5,0.78,8.6999999999999993,40,3.7999999999999999E-2,4.5836623610465859,6.2494447875554586,14.213333609973946]
[null,5.5E-2,null,680,null,38.299999999999997,null,0.48,null,0.45,null,1.8,null,0.78,null,2.1,null,2.1,2.7E-4,null,{"$f":"3*400^2/$W$61*(750-D62)/750/N62","v":731.29655902737545},null,{"$f":"SQRT(3*400^2*U62/($W$61*N62*P62))","v":1651.8305511216256},null,{"$f":"(3*400^2-N62*R62*2*$W$61*W62)/(2*$W$61*N62*R62)","v":213.72189537678088},null,{"$f":"(750-D62)/750","v":9.3333333333333338E-2},0,false,0,0,0,0,0,0,0,0,0,0]
[null,0.09,null,690,null,45.8,null,0.56999999999999995,null,0.52,null,2.2000000000000002,null,1.25,null,2.2999999999999998,null,2.2999999999999998,6.3000000000000003E-4,null,{"$f":"3*400^2/$W$61*(750-D63)/750/N63","v":391.13918814264196},null,{"$f":"SQRT(3*400^2*U63/($W$61*N63*P63))","v":911.84793408556595},null,{"$f":"(3*400^2-N63*R63*2*$W$61*W63)/(2*$W$61*N63*R63)","v":151.03029456291767},null,{"$f":"(750-D63)/750","v":0.08},0,false,0,0,0,0,0,0,0,0,0,0]
[null,0.12,null,690,null,46.4,null,0.55000000000000004,null,0.69,null,2.2000000000000002,null,1.67,null,2.5,null,2.5,8.0999999999999996E-4,null,292.76885340018111,null,654.65105789747531,null,77.271075602977518,null,0.08,0,false,0,0,0,0,0,0,0,0,0,0]
[null,0.18,null,700,null,59.9,null,0.6,null,0.75,null,3.1,null,2.46,null,3.2,null,3.6,1.8420000000000001E-3,null,165.62465622571224,null,{"$f":"SQRT(3*400^2*U65/($W$61*N65*P65))","v":358.58789946132816},null,{"$f":"(3*400^2-N65*R65*2*$W$61*W65)/(2*$W$61*N65*R65)","v":-13.536532324427695},null,6.6666666666666666E-2,0,false,0,0,0,0,0,0,0,0,0,0]
[null,0.25,null,700,null,70.7,null,0.62,null,0.85,null,3.1,null,3.52,null,2.9,null,3.1,2.176E-3,null,115.74904952137844,null,263.24738396482377,null,16.790639070769192,null,6.6666666666666666E-2,0,false,0,0,0,0,0,0,0,0,0,0]
[null,0.37,null,700,null,61.5,null,0.56000000000000005,null,1.6,null,3,null,5,null,1.9,null,2.4,3.2000000000000002E-3,null,81.487330863050417,null,228.95963372998827,null,25.688275217044286,null,6.6666666666666666E-2,0,false,0,0,0,0,0,0,0,0,0,0]
[null,0.55000000000000004,null,690,null,62.9,null,0.56999999999999995,null,2.35,null,3,null,7.5,null,1.7,null,2.1,4.3E-3,null,65.189864690440317,null,176.77083990541837,null,17.246614530415947,null,0.08,0,false,0,0,0,0,0,0,0,0,0,0]
[null,0.75,null,700,null,72,null,0.59,null,2.5499999999999998,null,3.5,null,10,null,2.1,null,2.7,6.8999999999999999E-3,null,40.743665431525208,null,108.89202623293741,null,4.2848221879659318,null,6.6666666666666666E-2,{"$f":"IF(B69<$AC$1,0,1)","v":0},{"$f":"AND(AB69=1,AB68=0)","v":false},0,0,0,0,0,0,0,{"$f":"AC69*U69","v":0},{"$f":"AC69*Y69","v":0},{"$f":"AC69*W69","v":0}]
[null,1.1000000000000001,null,700,null,73,null,0.64,null,3.35,null,3.5,null,15,null,2.1,null,2.7,8.2000000000000007E-3,null,27.162443621016806,null,72.594684155291617,null,2.8565481253106118,null,6.6666666666666666E-2,0,false,0,0,0,0,0,0,0,0,0,0]
[null,1.5,null,695,null,74.5,null,0.65,null,4.5,null,4.0999999999999996,null,21,null,1.9,null,2.5,1.6E-2,null,21.341919987941775,null,57.174973745192567,null,{"$f":"(3*400^2-N71*R71*2*$W$61*W71)/(2*$W$61*N71*R71)","v":1.0302625855577348},null,7.3333333333333334E-2,0,false,0,0,0,0,0,0,0,0,0,0]
[null,2.2000000000000002,null,720,null,80.5,null,0.67,null,5.9,null,5.3,null,29,null,1.9,null,2.5,3.7999999999999999E-2,null,8.4297238823845237,null,30.577822358275672,null,11.570797053646954,null,0.04,0,false,0,0,0,0,0,0,0,0,0,0]
[null,3,null,720,null,82,null,0.68,null,7.8,null,5.5,null,40,null,2.4,null,2.6,4.4999999999999998E-2,null,6.1115498147287806,null,19.724942209967995,null,9.6575088223819101,null,0.04,0,false,0,0,0,0,0,0,0,0,0,0]
[null,4,null,715,null,84.1,null,0.69,null,10,null,5.2,null,54,null,2.1,null,2.4,7.1999999999999995E-2,null,5.2815862596421557,null,16.871408436555306,null,6.707101651132894,null,4.6666666666666669E-2,1,true,4,715,84.1,0.69,10,54,7.1999999999999995E-2,5.2815862596421557,6.707101651132894,16.871408436555306]
[null,5.5,null,710,null,84.7,null,0.7,null,13.4,null,5.4,null,74,null,2.4,null,2.6,9.0999999999999998E-2,null,4.4047205871919139,null,12.311568318567387,null,3.5708376448649957,null,5.3333333333333337E-2,1,false,0,0,0,0,0,0,0,0,0,0]
[null,7.5,null,715,null,86.3,null,0.7,null,18.100000000000001,null,5.4,null,100,null,2.4,null,2.8,0.13100000000000001,null,2.8520565802067641,null,8.5221490502588431,null,2.391332761756837,null,4.6666666666666669E-2,1,false,0,0,0,0,0,0,0,0,0,0]
[null,11,null,720,null,88.7,null,0.76,null,23.5,null,5.9,null,146,null,2.4,null,2.6,0.224,null,1.6743972095147344,null,5.404093756155615,null,2.6458928280498388,null,0.04,1,false,0,0,0,0,0,0,0,0,0,0]
[null,15,null,740,null,91.1,null,0.82,null,29,null,7.4,null,194,null,1.8,null,3,0.45,null,0.42003778795386804,null,2.7113322625385559,null,2.5391400868847955,null,1.3333333333333334E-2,1,false,0,0,0,0,0,0,0,0,0,0]
[null,18.5,null,730,null,91.1,null,0.79,null,37,null,6.2,null,242,null,1.9,null,2.7,0.61,null,0.67344901539711077,null,2.9918757637383324,null,1.6848535098527146,null,2.6666666666666668E-2,1,false,0,0,0,0,0,0,0,0,0,0]
[null,22,null,730,null,91.5,null,0.77,null,45,null,6,null,288,null,1.9,null,2.7,0.68,null,0.56588424210451671,null,2.5140067181412378,null,1.4157449631401284,null,2.6666666666666668E-2,1,false,0,0,0,0,0,0,0,0,0,0]
[null,30,null,735,null,92.8,null,0.79,null,59,null,6.9,null,390,null,1.9,null,2.9,1.25,null,0.3134128110117323,null,1.6077737968209647,null,1.0940607808663834,null,0.02,1,false,0,0,0,0,0,0,0,0,0,0]
[null,37,null,735,null,93.2,null,0.81,null,71,null,7.2,null,481,null,2,null,2.9,1.52,null,0.2541184954149181,null,1.2705924770745907,null,0.92008420753677245,null,0.02,1,false,0,0,0,0,0,0,0,0,0,0]
[null,"Asincroni monofase",null,null,null,null,null,null,null,null,null,null,null,null,null,null,null,null,null,null,null,null,null,null,null,null,null,null,null,{"$f":"SUM(AD62:AD82)","v":4},{"$f":"SUM(AE62:AE82)","v":715},84.1,0.69,10,54,7.1999999999999995E-2,5.2815862596421557,6.707101651132894,16.871408436555306]
[null,0.18,null,2820,null,56.5,null,0.92,null,1.6,null,3.3,null,0.61,null,2,null,2,1.6000000000000001E-4,null,{"$f":"3*400^2/$W$1*(3000-D84)/3000/N84","v":150.28401183759297},null,{"$f":"SQRT(3*400^2*U84/($W$1*N84*P84))","v":433.832573446656},null,{"$f":"(3*400^2-N84*R84*2*$W$1*W84)/(2*$W$1*N84*R84)","v":192.35080920998141},null,{"$f":"(3000-D84)/3000","v":0.06},0,{"$f":"AND(AB84=1,AB83=0)","v":false},0,0,0,0,0,0,0,0,0,0]
[null,0.25,null,2820,null,60.5,null,0.94,null,1.95,null,3.6,null,0.85,null,2,null,2.1,3.6000000000000002E-4,null,{"$f":"3*400^2/$W$1*(3000-D85)/3000/N85","v":107.85087908344907},null,{"$f":"SQRT(3*400^2*U85/($W$1*N85*P85))","v":311.33867035583552},null,{"$f":"(3*400^2-N85*R85*2*$W$1*W85)/(2*$W$1*N85*R85)","v":116.6410085467402},null,{"$f":"(3000-D85)/3000","v":0.06},0,false,0,0,0,0,0,{"$f":"$AC85*N85","v":0},{"$f":"$AC85*S85","v":0},0,0,0]
[null,0.37,null,2855,null,71.5,null,0.99,null,2.2999999999999998,null,4.8,null,1.25,null,1.7,null,1.8,4.0000000000000002E-4,null,59.078314875711541,null,206.10107866633945,null,133.42946659637062,null,4.8333333333333332E-2,0,false,{"$f":"$AC86*B86","v":0},{"$f":"$AC86*D86","v":0},{"$f":"$AC86*F86","v":0},{"$f":"$AC86*H86","v":0},{"$f":"$AC86*J86","v":0},0,0,0,0,0]
[null,0.55000000000000004,null,2860,null,72.5,null,0.99,null,3.4,null,4.8,null,1.85,null,1.7,null,1.8,4.4999999999999999E-4,null,38.541305137929243,null,136.83543150802365,null,92.577099074888537,null,4.6666666666666669E-2,0,false,0,0,0,0,0,0,0,0,0,0]
[null,0.75,null,2860,null,74.5,null,0.99,null,4.4000000000000004,null,4.9000000000000004,null,2.5,null,1.7,null,1.8,5.0000000000000001E-4,null,28.520565802067644,null,101.25821931593751,null,68.507053315417522,null,4.6666666666666669E-2,0,false,0,0,0,0,0,0,0,0,0,0]
[null,0.75,null,2860,null,73,null,0.99,null,4.4000000000000004,null,4.5999999999999996,null,2,null,1.8,null,2.2000000000000002,7.2199999999999999E-4,null,35.650707252584553,null,123.00662620602643,null,50.616948076041211,null,4.6666666666666669E-2,0,false,0,0,0,0,0,0,0,0,0,0]
[null,1.1000000000000001,null,2860,null,74.5,null,0.99,null,6.5,null,4.5999999999999996,null,3.7,null,1.7,null,2.1,7.6300000000000001E-4,null,19.270652568964621,null,68.417715754011823,null,29.9019402100934,null,4.6666666666666669E-2,0,false,0,0,0,0,0,0,0,0,0,0]
[null,1.4,null,2860,null,75.5,null,0.99,null,8.1999999999999993,null,4.8,null,4.7,null,1.7,null,2,1.093E-3,null,15.170513724504065,null,53.860754955285906,null,27.409854283128723,null,4.6666666666666669E-2,0,false,0,0,0,0,0,0,0,0,0,0]
[null,1.5,null,2910,null,80,null,0.99,null,8.1999999999999993,null,4.5999999999999996,null,5,null,1.4,null,1.9,1.9E-3,null,9.1673247220931717,null,44.731964325168086,null,35.683164816000087,null,0.03,0,false,0,0,0,0,0,0,0,0,0,0]
[null,2.2000000000000002,null,2910,null,81.5,null,0.99,null,11.8,null,4.2,null,7.3,null,1.1000000000000001,null,1.8,2.3999999999999998E-3,null,6.2789895356802541,null,34.564699801957758,null,23.574092195081633,null,0.03,0,false,0,0,0,0,0,0,0,0,0,0]
[null,null,null,null,null,null,null,null,null,null,null,null,null,null,null,null,null,null,null,null,null,null,null,null,null,null,null,null,null,{"$f":"SUM(AD84:AD93)","v":0},{"$f":"SUM(AE84:AE93)","v":0},0,0,0,0,0,0,0,0]
[null,0.12,null,1350,null,49.5,null,0.95,null,1.2,null,3,null,0.85,null,1.6,null,1.5,2.5999999999999998E-4,null,{"$f":"3*400^2/$W$21*(1500-D95)/1500/N95","v":359.5029302781636},null,{"$f":"SQRT(3*400^2*U95/($W$21*N95*P95))","v":898.75732569540901},null,{"$f":"(3*400^2-N95*R95*2*$W$21*W95)/(2*$W$21*N95*R95)","v":299.58577523180298},null,{"$f":"(1500-D95)/1500","v":0.1},0,{"$f":"AND(AB95=1,AB94=0)","v":false},0,0,0,0,0,0,0,0,0,0]
[null,0.18,null,1360,null,55,null,0.97,null,1.5,null,3,null,1.25,null,1.6,null,1.5,2.9999999999999997E-4,null,{"$f":"3*400^2/$W$21*(1500-D96)/1500/N96","v":228.16452641654115},null,{"$f":"SQRT(3*400^2*U96/($W$21*N96*P96))","v":590.43180578892679},null,{"$f":"(3*400^2-N96*R96*2*$W$21*W96)/(2*$W$21*N96*R96)","v":224.44150284157735},null,{"$f":"(1500-D96)/1500","v":9.3333333333333338E-2},0,false,0,0,0,0,0,0,0,0,0,0]
[null,0.25,null,1410,null,64,null,0.99,null,1.75,null,4.3,null,1.7,null,1.7,null,1.6,6.6E-4,null,107.85087908344907,null,337.69420148471539,null,224.02912707491518,null,0.06,0,false,0,0,0,0,0,0,0,0,0,0]
[null,0.37,null,1410,null,67.5,null,0.98,null,2.4500000000000002,null,4.5,null,2.5,null,1.7,null,1.6,8.8999999999999995E-4,null,73.338597776745374,null,229.63205700960643,null,152.33980641094234,null,0.06,0,false,0,0,0,0,0,0,0,0,0,0]
[null,0.5,null,1410,null,68.5,null,0.98,null,3.2,null,4.5,null,3.4,null,1.7,null,1.6,1.1000000000000001E-3,null,53.925439541724536,null,168.8471007423577,null,112.01456353745759,null,0.06,0,false,0,0,0,0,0,0,0,0,0,0]
[null,0.55000000000000004,null,1410,null,70.5,null,0.93,null,3.7,null,4,null,3.7,null,1.9,null,1.8,1.2570000000000001E-3,null,49.553106605909029,null,146.7636354374344,null,82.64889514547778,null,0.06,0,false,0,0,0,0,0,0,0,0,0,0]
[null,0.75,null,1410,null,72,null,0.93,null,4.9000000000000004,null,4.0999999999999996,null,5.0999999999999996,null,2,null,1.8,1.565E-3,null,35.950293027816357,null,103.7795567852785,null,62.65698501016761,null,0.06,0,false,0,0,0,0,0,0,0,0,0,0]
[null,0.95,null,1410,null,73,null,0.93,null,6.1,null,4.0999999999999996,null,6.1,null,1.8,null,1.8,1.9480000000000001E-3,null,30.056802367518596,null,91.459937017581211,null,47.691925795004863,null,0.06,0,false,0,0,0,0,0,0,0,0,0,0]
[null,1.1000000000000001,null,1420,null,76,null,0.99,null,6.3,null,4,null,7.35,null,1.6,null,1.5,3.2000000000000002E-3,null,22.173423364095349,null,75.905525960169427,null,62.678370065426527,null,5.3333333333333337E-2,0,false,0,0,0,0,0,0,0,0,0,0]
[null,1.5,null,1430,null,79.5,null,0.99,null,8.3000000000000007,null,4.3,null,10,null,1.9,null,1.7,4.3E-3,null,14.260282901033822,null,47.890343307941052,null,41.985389261599835,null,4.6666666666666669E-2,0,false,0,0,0,0,0,0,0,0,0,0]
[null,1.7,null,1430,null,79.5,null,0.99,null,9.4,null,3.4,null,11.5,null,1.3,null,1.6,4.7999999999999996E-3,null,12.400246000898974,null,50.344871223470953,null,32.69249038969182,null,4.6666666666666669E-2,0,false,0,0,0,0,0,0,0,0,0,0]
[null,1.85,null,1390,null,76.5,null,0.99,null,10.6,null,3,null,12.7,null,1.3,null,1.4,6.8999999999999999E-3,null,17.64489447821958,null,57.147426308759307,null,28.785501344907473,null,7.3333333333333334E-2,0,false,0,0,0,0,0,0,0,0,0,0]
[null,2.2000000000000002,null,1400,null,79.5,null,0.99,null,12,null,3.2,null,15,null,1.2,null,1.5,8.2000000000000007E-3,null,13.581221810508403,null,48.016870195045662,null,19.889238857496352,null,6.6666666666666666E-2,0,false,0,0,0,0,0,0,0,0,0,0]
[null,null,null,null,null,null,null,null,null,null,null,null,null,null,null,null,null,null,null,null,null,null,null,null,null,null,null,null,null,{"$f":"SUM(AD95:AD107)","v":0},{"$f":"SUM(AE95:AE107)","v":0},0,0,0,0,0,0,0,0]
[null,0.18,null,880,null,52,null,0.99,null,1.5,null,2.8,null,1.95,null,1.5,null,1.3,6.3000000000000003E-4,null,{"$f":"3*400^2/$W$39*(1000-D109)/1000/N109","v":282.07152991055909},null,{"$f":"SQRT(3*400^2*U109/($W$39*N109*P109))","v":664.84897193140137},null,{"$f":"(3*400^2-N109*R109*2*$W$39*W109)/(2*$W$39*N109*R109)","v":239.22644444859577},null,{"$f":"(1000-D109)/1000","v":0.12},0,{"$f":"AND(AB109=1,AB108=0)","v":false},0,0,0,0,0,0,0,0,0,0]
[null,0.25,null,880,null,59,null,0.99,null,1.9,null,3,null,2.7,null,1.5,null,1.3,8.0999999999999996E-4,null,{"$f":"3*400^2/$W$39*(1000-D110)/1000/N110","v":203.71832715762599},null,{"$f":"SQRT(3*400^2*U110/($W$39*N110*P110))","v":480.16870195045652},null,{"$f":"(3*400^2-N110*R110*2*$W$39*W110)/(2*$W$39*N110*R110)","v":172.77465432398591},null,{"$f":"(1000-D110)/1000","v":0.12},0,false,0,0,0,0,0,0,0,0,0,0]
[null,0.32,null,880,null,61,null,0.99,null,2.2999999999999998,null,3,null,3.5,null,1.5,null,1.3,1.1000000000000001E-3,null,157.15413809302578,null,370.41585579035217,null,133.28330476421777,null,0.12,0,false,0,0,0,0,0,0,0,0,0,0]
[null,0.37,null,900,null,65,null,0.97,null,2.6,null,3,null,3.9,null,1.8,null,1.5,1.8420000000000001E-3,null,117.52980412939964,null,277.02040497141724,null,114.74560879324822,null,0.1,0,false,0,0,0,0,0,0,0,0,0,0]
[null,0.55000000000000004,null,900,null,66,null,0.97,null,3.8,null,3.1,null,5.8,null,1.8,null,1.5,2.176E-3,null,79.028661397354924,null,186.27234127388402,null,77.156530050632426,null,0.1,0,false,0,0,0,0,0,0,0,0,0,0]
[null,0.65,null,900,null,67.5,null,0.97,null,4.3,null,3.2,null,6.9,null,1.8,null,1.5,2.5760000000000002E-3,null,66.429889290530227,null,156.57675063601846,null,64.856213665748953,null,0.1,0,false,0,0,0,0,0,0,0,0,0,0]
[null,0.85,null,930,null,71,null,0.96,null,5.4,null,3.9,null,8.65,null,1.7,null,1.4,4.3E-3,null,37.093221418874101,null,107.5278769885311,null,81.723252699602099,null,7.0000000000000007E-2,0,false,0,0,0,0,0,0,0,0,0,0]
[null,"Due Velocita 3000/1500",null,null,null,null,null,null,null,null,null,null,null,null,null,null,null,null,null,null,null,null,null,null,null,null,null,null,null,{"$f":"SUM(AD109:AD115)","v":0},{"$f":"SUM(AE109:AE115)","v":0},0,0,0,0,0,0,0,0]
[0.11,7.0000000000000007E-2,2730,1370,53,44,0.75,0.57999999999999996,0.4,0.4,3.4,2.4,0.38,0.48,2.2000000000000002,2.7,2.2000000000000002,2.6,1.8000000000000001E-4,{"$f":"3*400^2/$W$1*Z117/M117","v":361.86808113525672},{"$f":"3*400^2/$W$21*(1500-D117)/1500/N117","v":551.7371360519038},{"$f":"SQRT(3*400^2*T117/($W$1*M117*O117))","v":813.2380351040913},{"$f":"SQRT(3*400^2*U117/($W$21*N117*P117))","v":1140.576153886798},{"$f":"(3*400^2-M117*Q117*2*$W$1*V117)/(2*$W$1*M117*Q117)","v":100.57025059100134},{"$f":"(3*400^2-N117*R117*2*$W$21*W117)/(2*$W$21*N117*R117)","v":83.692639127781561},{"$f":"(3000-C117)/3000","v":0.09},{"$f":"(1500-D117)/1500","v":8.666666666666667E-2},{"$f":"IF(A117<$AC$1,0,1)","v":0},{"$f":"AND(AB117=1,AB116=0)","v":false},{"$f":"$AC117*A117","v":0},{"$f":"$AC117*B117","v":0},{"$f":"$AC117*C117","v":0},{"$f":"$AC117*D117","v":0},{"$f":"$AC117*E117","v":0},{"$f":"$AC117*F117","v":0},{"$f":"$AC117*G117","v":0},{"$f":"$AC117*H117","v":0},{"$f":"$AC117*I117","v":0},{"$f":"$AC117*J117","v":0},{"$f":"$AC117*M117","v":0},{"$f":"$AC117*N117","v":0},{"$f":"$AC117*S117","v":0},{"$f":"$AC117*T117","v":0},{"$f":"$AC117*U117","v":0},{"$f":"$AC117*V117","v":0},{"$f":"$AC117*W117","v":0},{"$f":"$AC117*X117","v":0},{"$f":"$AC117*Y117","v":0}]
[0.2,0.15,2730,1400,63,54,0.7,0.63,0.65,0.65,3.6,3.3,0.7,1.02,2.1,2.1,2.1,2.1,1.9000000000000001E-4,196.44267261628224,199.72385015453534,451.8610758588726,533.78444231832066,67.828534237112166,179.51502251930538,0.09,6.6666666666666666E-2,0,{"$f":"AND(AB118=1,AB117=0)","v":false},0,0,0,0,0,0,0,0,0,0,0,0,0,0,0,0,0,0,0]
[0.3,0.2,2730,1400,59,55,0.78,0.63,0.95,0.85,2.8,3.6,1.05,1.36,1.7,2.1,1.8,2.2000000000000002,2.5999999999999998E-4,130.96178174418816,149.79288761590149,334.81033824954346,400.33833173874046,69.39269182511137,110.31923967910546,0.09,6.6666666666666666E-2,0,false,0,0,0,0,0,0,0,0,0,0,0,0,0,0,0,0,0,0,0]
[0.37,0.25,2700,1390,64,57,0.89,0.79,0.95,0.8,3,2.9,1.31,1.72,1.7,1.9,1.7,1.9,6.6E-4,116.63263005207598,130.28497667057479,282.87567829311638,349.03326995611741,60.161468918871812,118.49655063206963,0.1,7.3333333333333334E-2,0,{"$f":"AND(AB120=1,AB119=0)","v":false},0,0,0,0,0,0,0,0,0,0,0,0,0,0,0,0,0,0,0]
[0.48,0.31,2700,1390,68,65,0.91,0.76,1.1000000000000001,0.9,3.2,3.4,1.7,2.14,1.7,2.1,1.7,2.1,8.8999999999999995E-4,89.875732569540901,104.71502797821898,217.98066974351912,266.83859955205844,46.359720166895308,73.14525752008106,0.1,7.3333333333333334E-2,0,false,0,0,0,0,0,0,0,0,0,0,0,0,0,0,0,0,0,0,0]
[0.55000000000000004,0.37,2800,1400,70,68,0.8,0.65,1.4,1.2,4.5999999999999996,4.0999999999999996,1.87,2.52,2.4,2.9,2.4,2.9,1.1000000000000001E-3,54.4701409512369,80.84060601493097,136.17535237809224,183.85531578495628,34.043838094523082,25.215217012278977,6.6666666666666666E-2,6.6666666666666666E-2,0,false,0,0,0,0,0,0,0,0,0,0,0,0,0,0,0,0,0,0,0]
[0.63,0.5,2690,1400,66,67,0.87,0.79,1.6,1.35,3.6,4.2,2.25,3.42,1.8,1.9,1.9,2.1,1.2999999999999999E-3,70.169646020960073,59.566762326791242,162.70197080820955,167.36815331139493,15.998316172164188,45.370283570002329,0.10333333333333333,6.6666666666666666E-2,0,false,0,0,0,0,0,0,0,0,0,0,0,0,0,0,0,0,0,0,0]
[0.85,0.65,2725,1405,70,70,0.88,0.8,2,1.7,4,4.4000000000000004,2.99,4.43,1.9,2,1.9,2.2000000000000002,1.6000000000000001E-3,46.841588602296952,43.686774446894972,112.24037148939559,122.74923930219461,22.233088612892331,34.021482397189253,9.166666666666666E-2,6.3333333333333339E-2,0,false,0,0,0,0,0,0,0,0,0,0,0,0,0,0,0,0,0,0,0]
[1.1000000000000001,0.8,2730,1410,72,71,0.88,0.79,2.5499999999999998,2.0499999999999998,4.2,4.7,3.8,5.38,2,2,2.1,2.4,2E-3,36.186808113525679,34.07927405982592,85.293124688567943,98.378390261137625,10.439171908060834,19.95242244659126,0.09,0.06,0,{"$f":"AND(AB125=1,AB124=0)","v":false},0,0,0,0,0,0,0,0,0,0,0,0,0,0,0,0,0,0,0]
[1.3,1,2730,1400,71,71,0.88,0.8,3.1,2.6,3.9,3.8,4.5,6.8,2,1.5,2.2000000000000002,2,3.2000000000000002E-3,30.557749073643905,29.958577523180303,72.02530529256849,94.737340431975596,5.1407277216837919,17.607325279950519,0.09,6.6666666666666666E-2,0,false,0,0,0,0,0,0,0,0,0,0,0,0,0,0,0,0,0,0,0]
[1.9,1.5,2820,1420,74,75,0.82,0.76,4.4000000000000004,3.9,5.0999999999999996,4.4000000000000004,6.4,10,2.8,2,3,2.5,4.3E-3,14.323944878270579,16.297466172610079,34.946847129037572,49.900595278955265,4.8418886439362572,11.214902868332548,0.06,5.3333333333333337E-2,0,false,0,0,0,0,0,0,0,0,0,0,0,0,0,0,0,0,0,0,0]
[2.5,2.1,2800,1430,68,76,0.88,0.81,6,5,4.8,4.4000000000000004,8.5,14,2.2000000000000002,1.6,2.5,2.2000000000000002,6.8999999999999999E-3,11.983431009272119,10.1859163578813,31.29071370601369,37.276636937640063,4.6595793218026671,12.330098571522109,6.6666666666666666E-2,4.6666666666666669E-2,0,false,0,0,0,0,0,0,0,0,0,0,0,0,0,0,0,0,0,0,0]
[3.4,2.7,2810,1430,78,80,0.88,0.85,7.2,5.9,5.3,5.4,11.5,18,2.2000000000000002,1.9,2.5,2.5,8.2000000000000007E-3,8.4144526434671629,7.9223793894632344,22.54230684222513,26.605746282189475,4.0296488739869591,7.3473082440815309,6.3333333333333339E-2,4.6666666666666669E-2,0,false,0,0,0,0,0,0,0,0,0,0,0,0,0,0,0,0,0,0,0]
[4,2.6,2865,1430,82,77,0.94,0.76,7.6,6.5,6.3,6.2,13.3,17.399999999999999,1.8,2.2999999999999998,2.1,2.6,1.2E-2,5.1695440162179533,8.1955648856516223,18.163926173047951,25.015638052180371,9.1881585688459833,8.7572941689114803,4.4999999999999998E-2,4.6666666666666669E-2,1,true,4,2.6,2865,1430,82,77,0.94,0.76,7.6,6.5,13.3,17.399999999999999,1.2E-2,5.1695440162179533,8.1955648856516223,18.163926173047951,25.015638052180371,9.1881585688459833,8.7572941689114803]
[4.7,3.1,2820,1420,79,77,0.93,0.76,9.1999999999999993,7.7,5.5,5.7,15.9,20.8,1.8,2.2000000000000002,2.1,2.4,1.6E-2,5.7656130327630004,7.8353202752933075,17.544201754944819,22.87420710556205,5.3352150417337558,7.7325127198024362,0.06,5.3333333333333337E-2,1,false,0,0,0,0,0,0,0,0,0,0,0,0,0,0,0,0,0,0,0]
[7.2,4.8,2870,1435,84,81,0.93,0.76,13.3,11.5,7.1,6.2,24,31.9,2.4,2.5,2.6,2.7,2.1999999999999999E-2,2.7586856802595192,4.1510003966287439,8.5543211541509852,12.611644543337528,3.68836677599481,5.1276733909733432,4.3333333333333335E-2,4.3333333333333335E-2,1,false,0,0,0,0,0,0,0,0,0,0,0,0,0,0,0,0,0,0,0]
[9,6.5,2885,1440,83,82,0.92,0.74,17.100000000000001,15.6,4.5999999999999996,4.3,40,43,1.3,1.7,1.9,1.9,3.9E-2,1.464225476445437,2.8425813091761767,6.5591564520125036,10.900801710450251,3.4927346906335175,7.8003911130772288,3.833333333333333E-2,0.04,1,false,{"$f":"$AC133*A133","v":0},{"$f":"$AC133*B133","v":0},0,0,0,0,0,0,0,0,0,0,{"$f":"$AC133*S133","v":0},0,0,0,0,0,0]
[12.5,9,2890,1440,85.5,85.5,0.93,0.8,22.5,19,5.2,4.5999999999999996,41,60,1.4,1.8,1.9,1.9,5.3999999999999999E-2,1.3664034138621259,2.0371832715762599,6.0308594228514574,7.5921337964498878,3.7758636431446613,5.8103877270781394,3.6666666666666667E-2,0.04,1,false,0,0,0,0,0,0,0,0,0,0,0,0,0,0,0,0,0,0,0]
[15,10.5,2900,1445,87,86,0.93,0.77,27,23,5.8,4.9000000000000004,49,69,1.6,2.1,2.1,2.1,5.7000000000000002E-2,1.0393792201919696,1.6238417382129611,4.500644044259527,5.8519194217789252,2.9234932428259697,4.6925074497338084,3.3333333333333333E-2,3.6666666666666667E-2,1,false,0,0,0,0,0,0,0,0,0,0,0,0,0,0,0,0,0,0,0]
[18,12,2940,1455,89,89,0.88,0.79,33,25,6.8,5.3,59,79,2.1,2.4,2.6,2.2000000000000002,9.4E-2,0.51792795040074413,1.1604208508978697,2.5272296228908524,4.3246331751929743,2.452846823270149,4.4664338770636141,0.02,0.03,1,false,0,0,0,0,0,0,0,0,0,0,0,0,0,0,0,0,0,0,0]
[24,17,2945,1455,90,90,0.89,0.8,43,34,7.4,5.2,78,111,2.4,2.4,2.8,2.1,0.108,0.35911884595094334,0.82588511009848387,1.7120319235363772,3.0778920796418467,1.7858789136481359,3.4767516512985015,1.8333333333333333E-2,0.03,1,false,0,0,0,0,0,0,0,0,0,0,0,0,0,0,0,0,0,0,0]
[32,24,2940,1470,89,90.5,0.89,0.86,58,45,6.8,5.9,104,156,1.8,2.1,2.4,2.1,0.28000000000000003,0.2938245103234991,0.39176601376466541,1.5485911416765241,1.9116224070584651,1.5120808408599249,2.7522587091875521,0.02,0.02,1,false,0,0,0,0,0,0,0,0,0,0,0,0,0,0,0,0,0,0,0]
[39,29,2950,1470,90.5,91,0.84,0.86,75,53,6.8,7,126,188,1.7,2.2000000000000002,2.6,2.4,0.34,0.2021015150373274,0.32508243695365852,1.2006619112764387,1.5497697102805115,1.1312786468465696,1.8365056746534318,1.6666666666666666E-2,0.02,1,false,0,0,0,0,0,0,0,0,0,0,0,0,0,0,0,0,0,0,0]
[42,32,2955,1475,92.5,93,0.92,0.88,71,57,7.1,6.5,136,207,1.5,1.9,2.5,2.2999999999999998,0.49,0.16851699856788918,0.24603662700196383,1.1234466571192612,1.3826064838767409,1.1234466571192612,1.8265669118010481,1.4999999999999999E-2,1.6666666666666666E-2,1,false,0,0,0,0,0,0,0,0,0,0,0,0,0,0,0,0,0,0,0]
[50,40,2960,1475,92.5,93,0.84,0.87,94,71,7.4,7.1,161,259,1.8,2,2.8,2.5,0.49,0.12653312245815282,0.19663931192821046,0.81676779337341587,1.0770378683537554,0.87787223954827387,1.2826338747847701,1.3333333333333334E-2,1.6666666666666666E-2,1,false,0,0,0,0,0,0,0,0,0,0,0,0,0,0,0,0,0,0,0]
[68,50,2940,1475,93,93.5,0.93,0.88,113,87,6.6,6.9,220,324,1.5,2.1,2.4,2.5,0.89,0.13889885942565411,0.15719006725125467,0.80193293879533389,0.84021625179735659,0.64493018022189641,1.0460645552176993,0.02,1.6666666666666666E-2,1,false,0,0,0,0,0,0,0,0,0,0,0,0,0,0,0,0,0,0,0]
[50,25,2965,1485,93,93,0.91,0.76,86,52,8.9,8.5,161,161,2.1,3.5,2.9,2.9,0.56999999999999995,0.1107164821508837,0.18979968368722919,0.70734165805433735,1.0145219835366839,0.92886251166315603,2.2578863558983029,1.1666666666666667E-2,0.01,{"$f":"IF(A143<$AC$1,0,1)","v":1},false,{"$f":"$AC143*A143","v":0},{"$f":"$AC143*B143","v":0},0,0,0,0,0,0,0,0,0,0,{"$f":"$AC143*S143","v":0},0,0,0,0,0,0]
["1500/750",null,null,null,null,null,null,null,null,null,null,null,null,null,null,null,null,null,null,null,null,null,null,null,null,null,null,null,null,{"$f":"SUM(AD117:AD143)","v":4},2.6,2865,1430,82,77,0.94,0.76,7.6,6.5,13.3,17.399999999999999,1.2E-2,5.1695440162179533,8.1955648856516223,18.163926173047951,25.015638052180371,9.1881585688459833,8.7572941689114803]
[0.11,0.06,1390,660,54,33,0.6,0.54,0.5,0.5,3,1.7,0.75,0.87,2.5,2.5,2.6,2.6,2.5999999999999998E-4,{"$f":"3*400^2/$W$21*(1500-C145)/1500/M145","v":298.78687983118488},{"$f":"3*400^2/$W$39*(750-D145)/750/N145","v":632.22929117883939},{"$f":"SQRT(3*400^2*T145/($W$21*M145*O145))","v":697.81581143367976},{"$f":"SQRT(3*400^2*U145/($W$39*N145*P145))","v":1154.2874809805076},{"$f":"(3*400^2-M145*Q145*2*$W$21*V145)/(2*$W$21*M145*Q145)","v":85.716216095651063},{"$f":"(3*400^2-N145*R145*2*$W$39*W145)/(2*$W$39*N145*R145)","v":-141.09951434775218},{"$f":"(1500-C145)/1500","v":7.3333333333333334E-2},{"$f":"(1000-D145)/1000","v":0.34},{"$f":"IF(A145<$AC$1,0,1)","v":0},false,{"$f":"$AC145*A145","v":0},{"$f":"$AC145*B145","v":0},{"$f":"$AC145*C145","v":0},{"$f":"$AC145*D145","v":0},{"$f":"$AC145*E145","v":0},{"$f":"$AC145*F145","v":0},{"$f":"$AC145*G145","v":0},{"$f":"$AC145*H145","v":0},{"$f":"$AC145*I145","v":0},{"$f":"$AC145*J145","v":0},{"$f":"$AC145*M145","v":0},{"$f":"$AC145*N145","v":0},{"$f":"$AC145*S145","v":0},{"$f":"$AC145*T145","v":0},{"$f":"$AC145*U145","v":0},{"$f":"$AC145*V145","v":0},{"$f":"$AC145*W145","v":0},{"$f":"$AC145*X145","v":0},{"$f":"$AC145*Y145","v":0},null,null,null,null,null,null,null,null,null,null,null,null,null,null,null,null,null,null,null,null,null,null,null,null,null,null,"M3VA",71,"A","3GVA",79,"231-封B"]
[0.18,0.11,1350,680,54,37,0.8,0.7,0.6,0.6,3.1,2.1,1.27,1.54,1.9,2,2,1.9,6.6E-4,240.61219743026697,277.79771885130822,552.00223851673195,642.97677945876342,49.528255058935464,140.28746542274487,0.1,0.32,0,false,0,0,0,0,0,0,0,0,0,0,0,0,0,0,0,0,0,0,0,null,null,null,null,null,null,null,null,null,null,null,null,null,null,null,null,null,null,null,null,null,null,null,null,null,null,"M3VA",71,"B","3GVA",79,"232-封B"]
[0.3,0.15,1350,680,60,47,0.8,0.51,0.9,0.9,2.9,2.1,2.12,2.11,1.6,2.4,1.6,2.2000000000000002,8.8999999999999995E-4,144.14032581907503,202.75283745545721,360.35081454768755,428.39355808439751,90.087703636921887,65.322766888306703,0.1,0.32,0,false,0,0,0,0,0,0,0,0,0,0,0,0,0,0,0,0,0,0,0,null,null,null,null,null,null,null,null,null,null,null,null,null,null,null,null,null,null,null,null,null,null,null,null,null,null,"M3VA",80,"A","3GVA",89,"231-封B"]
[0.45,0.25,1380,700,65,48,0.87,0.57999999999999996,1.1499999999999999,1.3,3.5,2.7,3.12,3.42,1.7,2.1,1.7,2.1,1.9E-3,78.353202752933072,89.350143490186866,212.46495180939704,238.79830314240661,75.598293605798119,80.309352179689313,0.08,0.3,0,false,0,0,0,0,0,0,0,0,0,0,0,0,0,0,0,0,0,0,0,null,null,null,null,null,null,null,null,null,null,null,null,null,null,null,null,null,null,null,null,null,null,null,null,null,null,"M3VA",80,"B","3GVA",89,"232-封B"]
[0.63,0.33,1350,680,63,48,0.88,0.64,1.65,1.55,3.5,2.8,4.46,4.6399999999999997,1.7,2.2000000000000002,1.7,2.2000000000000002,2.2000000000000001E-3,68.51513245211639,92.200104963580756,166.17360473721189,203.47060983836616,35.341490710189255,21.042632767755819,0.1,0.32,0,false,0,0,0,0,0,0,0,0,0,0,0,0,0,0,0,0,0,0,0,null,null,null,null,null,null,null,null,null,null,null,null,null,null,null,null,null,null,null,null,null,null,null,null,null,null,"M3VA",80,"C","3GVA",89,"233-封B"]
[0.75,0.37,1335,690,68,49,0.89,0.62,1.8,1.76,3.9,2.9,5.37,5.12,1.9,2.5,1.9,2.5,2.5000000000000001E-3,62.595016724410236,71.619724391352904,136.91991370519929,160.14657226886484,12.828930133102721,18.902738709517411,0.11,0.31,0,false,0,0,0,0,0,0,0,0,0,0,0,0,0,0,0,0,0,0,0,null,null,null,null,null,null,null,null,null,null,null,null,null,null,null,null,null,null,null,null,null,null,null,null,null,null,"M3AA",90,"S","3GAA",98,"216-封E"]
[0.7,0.37,1420,700,72,50,0.8,0.56999999999999995,1.8,1.9,4.4000000000000004,2.2999999999999998,4.7,5.0999999999999996,1.6,1.6,2.2999999999999998,2.2000000000000002,3.2000000000000002E-3,34.675459941723574,59.917155046360605,118.70332251217984,183.45807087851207,22.636867467671724,20.804957688626306,5.3333333333333337E-2,0.3,0,false,0,0,0,0,0,0,0,0,0,0,0,0,0,0,0,0,0,0,0,null,null,null,null,null,null,null,null,null,null,null,null,null,null,null,null,null,null,null,null,null,null,null,null,null,null,"M3AA",90,"L","3GAA",98,"217-封E"]
[1.1000000000000001,0.55000000000000004,1390,685,70,55,0.84,0.57999999999999996,2.6,2.6,4.0999999999999996,2.2999999999999998,7.4,7.5,1.4,1.5,2,2.1,4.3E-3,30.282454036944412,52.966765060982773,94.509689386769281,146.90337486371376,8.7259493755411928,-1.3902840368380196,7.3333333333333334E-2,0.315,0,false,0,0,0,0,0,0,0,0,0,0,0,0,0,0,0,0,0,0,0,null,null,null,null,null,null,null,null,null,null,null,null,null,null,null,null,null,null,null,null,null,null,null,null,null,null,"M3AA",100,"LB","3GAA",108,"215-封A"]
[1.5,0.75,1440,710,76,62,0.85,0.56999999999999995,3.4,3.2,4.5999999999999996,2.8,10,10,1.4,1.5,2.2000000000000002,2.2000000000000002,6.8999999999999999E-3,12.223099629457561,24.446199258915126,51.652023289033067,86.430366351082185,17.797406423793987,17.743778218158397,0.04,0.28999999999999998,0,false,0,0,0,0,0,0,0,0,0,0,0,0,0,0,0,0,0,0,0,null,null,null,null,null,null,null,null,null,null,null,null,null,null,null,null,null,null,null,null,null,null,null,null,null,null,"M3AA",112,"M","3GAA",118,"202-封C"]
[2,0.95,1440,710,78,64,0.86,0.55000000000000004,4.4000000000000004,4,4.8,2.9,13,12,1.4,1.6,2.2000000000000002,2.2999999999999998,8.2000000000000007E-3,9.4023843303519694,20.371832715762604,39.732325606948507,69.738201975905682,13.690312633687688,13.299159637257111,0.04,0.28999999999999998,0,false,0,0,0,0,0,0,0,0,0,0,0,0,0,0,0,0,0,0,0,null,null,null,null,null,null,null,null,null,null,null,null,null,null,null,null,null,null,null,null,null,null,null,null,null,null,"M3AA",132,"S","3GAA",138,"223-封C"]
[2.5,1.5,1410,705,78,67,0.9,0.66,5.0999999999999996,4.9000000000000004,5.5,4.0999999999999996,16.899999999999999,20.3,1.4,1.5,2.1,2.4,1.7999999999999999E-2,10.848904996559966,13.547770525260843,37.432278473516078,45.159235084202813,5.6189318302933104,1.8816347951751231,0.06,0.29499999999999998,0,false,0,0,0,0,0,0,0,0,0,0,0,0,0,0,0,0,0,0,0,null,null,null,null,null,null,null,null,null,null,null,null,null,null,null,null,null,null,null,null,null,null,null,null,null,null,"M3AA",132,"M","3GAA",138,"224-封C"]
[3.8,1.9,1450,730,82,70,0.86,0.52,7.7,7.6,5.6,3.7,25,24.9,1.4,1.3,2.1,2.7,3.7999999999999999E-2,4.0743665431525207,4.9088753531958087,18.860652197457064,26.3648899142182,10.241965967918084,7.7245222607526891,3.3333333333333333E-2,0.27,1,true,3.8,1.9,1450,730,82,70,0.86,0.52,7.7,7.6,25,24.9,3.7999999999999999E-2,4.0743665431525207,4.9088753531958087,18.860652197457064,26.3648899142182,10.241965967918084,7.7245222607526891,null,null,null,null,null,null,null,null,null,null,null,null,null,null,null,null,null,null,null,null,null,null,null,null,null,null,"M3AA",160,"M","3GAA",168,"361-封C"]
[5,2.5,1455,730,85,73,0.88,0.52,9.6,9.6,6.9,4.8,32.799999999999997,32.700000000000003,1.7,2,2.4,2.8,4.8000000000000001E-2,2.7949160738088938,3.737950957020661,12.376096394002181,16.185802434401236,7.033043007448474,8.8451191527906925,0.03,0.27,1,{"$f":"AND(AB157=1,AB156=0)","v":false},0,0,0,0,0,0,0,0,0,0,0,0,0,0,0,0,0,0,0,null,null,null,null,null,null,null,null,null,null,null,null,null,null,null,null,null,null,null,null,null,null,null,null,null,null,"M3AA",160,"L","3GAA",168,"362-封C"]
[8,4.5,1440,730,84.5,79.5,0.86,0.6,16,13.5,4.5,3.4,53,59,1.3,1.4,1.8,1.9,8.8999999999999996E-2,2.3062452131052003,2.071711801602977,10.113554293211822,10.72212722376986,5.9020374644631799,9.7223971341542548,0.04,0.27,1,{"$f":"AND(AB158=1,AB157=0)","v":false},0,0,0,0,0,0,0,0,0,0,0,0,0,0,0,0,0,0,0,null,null,null,null,null,null,null,null,null,null,null,null,null,null,null,null,null,null,null,null,null,null,null,null,null,null,"M3AA",180,"L","3GAA",188,"354-封C"]
[12,7,1445,730,86.5,81,0.87,0.59,23,21,5,3.5,79,92,1.5,1.4,1.9,1.9,0.11899999999999999,1.4182921510973965,1.3285977858106046,6.0476180523100913,6.8761468065480615,4.1315122187238549,6.2350155534250113,3.6666666666666667E-2,0.27,1,{"$f":"AND(AB159=1,AB158=0)","v":false},0,0,0,0,0,0,0,0,0,0,0,0,0,0,0,0,0,0,0,null,null,null,null,null,null,null,null,null,null,null,null,null,null,null,null,null,null,null,null,null,null,null,null,null,null,"M3AA",200,"MLA","3GAA",208,"204-封C"]
[16,8,1460,730,88,78.5,0.86,0.53,31,28,1.9,3.4,105,104,1.4,1.6,1.9,2.1,0.224,0.77606981774333716,1.1752980412939964,4.0165428965233119,5.6898871759523058,3.6420408312069905,4.8038453356012338,2.6666666666666668E-2,0.27,1,false,0,0,0,0,0,0,0,0,0,0,0,0,0,0,0,0,0,0,0,null,null,null,null,null,null,null,null,null,null,null,null,null,null,null,null,null,null,null,null,null,null,null,null,null,null,"M3AA",200,"MLB","3GAA",208,"205-封C"]
[22,13,1475,735,87.5,86,0.81,0.69,45,32,6.5,5.9,142,169,2,2.5,2.6,2.7,0.36,0.35865902668596134,0.54244524982799835,1.9644563936874837,2.4258889053745207,2.1739169911505316,2.5967522967365748,1.6666666666666666E-2,0.26500000000000001,1,false,0,0,0,0,0,0,0,0,0,0,0,0,0,0,0,0,0,0,0,null,null,null,null,null,null,null,null,null,null,null,null,null,null,null,null,null,null,null,null,null,null,null,null,null,null,"M3AA",200,"MLC","3GAA",208,"206-封C"]
[25,15,1475,735,89,86,0.86,0.67,47,38,7.6,6,162,195,2.2000000000000002,2.6,2.7,2.7,0.42,0.31438013450250935,0.47011921651759853,1.6417967067970149,2.0616091443854869,1.8513158987864218,2.2913465641107962,1.6666666666666666E-2,0.26500000000000001,1,false,0,0,0,0,0,0,0,0,0,0,0,0,0,0,0,0,0,0,0,null,null,null,null,null,null,null,null,null,null,null,null,null,null,null,null,null,null,null,null,null,null,null,null,null,null,"M3AA",225,"SMB","3GAA",228,"203-封C"]
[29,17,1475,735,90,88,0.91,0.75,52,38,7.2,6.1,188,221,2.2000000000000002,2.6,2.4,2.4,0.48,0.27090203079471548,0.41481107339788104,1.4147397154314703,1.8190668921048414,1.9715356695024731,2.5018817891230869,1.6666666666666666E-2,0.26500000000000001,1,false,0,0,0,0,0,0,0,0,0,0,0,0,0,0,0,0,0,0,0,null,null,null,null,null,null,null,null,null,null,null,null,null,null,null,null,null,null,null,null,null,null,null,null,null,null,"M3AA",225,"SMC","3GAA",228,"204-封C"]
[35,21,1475,735,90,89,0.9,0.74,63,47,6.7,5.8,227,273,1.7,2.1,2.2000000000000002,2.2999999999999998,0.63,0.22435939114275996,0.33579944036971326,1.3328933993024783,1.638533491764399,1.7265528435533388,2.011460425297702,1.6666666666666666E-2,0.26500000000000001,1,false,0,0,0,0,0,0,0,0,0,0,0,0,0,0,0,0,0,0,0,null,null,null,null,null,null,null,null,null,null,null,null,null,null,null,null,null,null,null,null,null,null,null,null,null,null,"M3AA",250,"SMB","3GAA",258,"202-封C"]
[42,25,1475,735,91,89.5,0.91,0.75,74,54,6.8,5.9,272,325,1.8,2.1,2.2000000000000002,2.2000000000000002,0.74,0.18724110951987688,0.28207152991055912,1.0810370498466511,1.3763681330820949,1.4722508072425786,1.8289901613560768,1.6666666666666666E-2,0.26500000000000001,1,false,0,0,0,0,0,0,0,0,0,0,0,0,0,0,0,0,0,0,0]
[55,33,1480,740,92,90.5,0.9,0.75,97,71,7.3,6.4,355,426,2.1,2.5,2.5,2.5,1.5,{"$f":"3*400^2/$W$21*(1500-C166)/1500/M166","v":0.11477088853950761},{"$f":"3*400^2/$W$39*(750-D166)/750/N166","v":0.14346361067438454},{"$f":"SQRT(3*400^2*T166/($W$21*M166*O166))","v":0.68588724750574181},{"$f":"SQRT(3*400^2*U166/($W$39*N166*P166))","v":0.78578255747499348},{"$f":"(3*400^2-M166*Q166*2*$W$21*V166)/(2*$W$21*M166*Q166)","v":1.0356760805868723},{"$f":"(3*400^2-N166*R166*2*$W$39*W166)/(2*$W$39*N166*R166)","v":1.3661716026407749},{"$f":"(1500-C166)/1500","v":1.3333333333333334E-2},{"$f":"(1000-D166)/1000","v":0.26},{"$f":"IF(A166<$AC$1,0,1)","v":1},false,{"$f":"$AC166*A166","v":0},0,0,0,0,0,0,0,0,0,{"$f":"$AC166*M166","v":0},{"$f":"$AC166*N166","v":0},{"$f":"$AC166*S166","v":0},0,0,0,0,0,0]
["Sincroni",null,null,null,null,null,null,null,null,null,null,null,null,null,null,null,null,null,null,null,null,null,null,null,null,null,null,null,null,{"$f":"SUM(AD145:AD166)","v":3.8},1.9,1450,730,82,70,0.86,0.52,7.7,7.6,25,24.9,3.7999999999999999E-2,4.0743665431525207,4.9088753531958087,18.860652197457064,26.3648899142182,10.241965967918084,7.7245222607526891]
[null,3,null,152,null,78.900000000000006,null,0.85,null,21,null,null,null,null,null,null,null,null,1.2,null,null,null,null,null,null,null,null,{"$f":"IF(B168<$AC$1,0,1)","v":0},{"$f":"AND(AB168=1,AB167=0)","v":false},{"$f":"$AC168*B168","v":0},{"$f":"$AC168*D168","v":0},{"$f":"$AC168*F168","v":0},{"$f":"$AC168*H168","v":0},{"$f":"$AC168*J168","v":0},{"$f":"$AC168*N168","v":0},{"$f":"$AC168*S168","v":0}]
[null,5,null,152,null,82.2,null,0.87,null,21,null,null,null,null,null,null,null,null,1.5,null,null,null,null,null,null,null,null,{"$f":"IF(B169<$AC$1,0,1)","v":1},true,{"$f":"$AC169*B169","v":5},{"$f":"$AC169*D169","v":152},{"$f":"$AC169*F169","v":82.2},{"$f":"$AC169*H169","v":0.87},{"$f":"$AC169*J169","v":21},{"$f":"$AC169*N169","v":0},{"$f":"$AC169*S169","v":1.5}]
[null,7,null,152,null,84,null,0.9,null,21,null,null,null,null,null,null,null,null,1.8,null,null,null,null,null,null,null,null,{"$f":"IF(B170<$AC$1,0,1)","v":1},false,{"$f":"$AC170*B170","v":0},{"$f":"$AC170*D170","v":0},{"$f":"$AC170*F170","v":0},{"$f":"$AC170*H170","v":0},{"$f":"$AC170*J170","v":0},{"$f":"$AC170*N170","v":0},{"$f":"$AC170*S170","v":0}]
[null,9,null,152,null,85,null,0.92,null,21,null,null,null,null,null,null,null,null,1.8,null,null,null,null,null,null,null,null,{"$f":"IF(B171<$AC$1,0,1)","v":1},false,{"$f":"$AC171*B171","v":0},{"$f":"$AC171*D171","v":0},{"$f":"$AC171*F171","v":0},{"$f":"$AC171*H171","v":0},{"$f":"$AC171*J171","v":0},{"$f":"$AC171*N171","v":0},{"$f":"$AC171*S171","v":0}]
[null,11,null,152,null,86.5,null,0.93,null,21,null,null,null,819,null,400,null,null,2.2000000000000002,null,null,null,null,null,null,null,null,{"$f":"IF(B172<$AC$1,0,1)","v":1},false,{"$f":"$AC172*B172","v":0},{"$f":"$AC172*D172","v":0},{"$f":"$AC172*F172","v":0},{"$f":"$AC172*H172","v":0},{"$f":"$AC172*J172","v":0},{"$f":"$AC172*N172","v":0},{"$f":"$AC172*S172","v":0}]
[null,16,null,152,null,88.1,null,0.92,null,31,null,null,null,1228,null,400,null,null,3.9,null,null,null,null,null,null,null,null,{"$f":"IF(B173<$AC$1,0,1)","v":1},false,0,{"$f":"$AC173*D173","v":0},{"$f":"$AC173*F173","v":0},{"$f":"$AC173*H173","v":0},{"$f":"$AC173*J173","v":0},{"$f":"$AC173*N173","v":0},{"$f":"$AC173*S173","v":0}]
[null,24,null,152,null,90,null,0.94,null,45,null,null,null,1833,null,400,null,null,5.8,null,null,null,null,null,null,null,null,1,false,0,0,0,0,0,0,0]
[null,30,null,152,null,90.9,null,0.97,null,53,null,null,null,2242,null,400,null,null,7.8,null,null,null,null,null,null,null,null,1,false,0,0,0,0,0,0,0]
[null,40,null,152,null,91.4,null,0.96,null,72,null,null,null,3038,null,400,null,null,17.100000000000001,null,null,null,null,null,null,null,null,1,false,0,0,0,0,0,0,0]
[null,54,null,152,null,91.8,null,0.95,null,96,null,null,null,4047,null,400,null,null,22.4,null,null,null,null,null,null,null,null,1,false,0,0,0,0,0,0,0]
[null,67,null,152,null,92.5,null,0.99,null,116,null,null,null,5067,null,400,null,null,28.5,null,null,null,null,null,null,null,null,1,false,0,0,0,0,0,0,0]
[null,null,null,null,null,null,null,null,null,null,null,null,null,null,null,null,null,null,null,null,null,null,null,null,null,null,null,null,null,{"$f":"SUM(AD168:AD178)","v":5},{"$f":"SUM(AE168:AE178)","v":152},82.2,0.87,21,0,1.5]
[null,16,null,208,null,89.1,null,0.93,null,31,null,null,null,899,null,400,null,null,2.2000000000000002,null,null,null,null,null,null,null,null,{"$f":"IF(B180<$AC$1,0,1)","v":1},{"$f":"AND(AB180=1,AB179=0)","v":true},{"$f":"$AC180*B180","v":16},208,89.1,0.93,31,899,2.2000000000000002]
[null,24,null,208,null,90.7,null,0.93,null,45,null,null,null,1343,null,400,null,null,3.9,null,null,null,null,null,null,null,null,{"$f":"IF(B181<$AC$1,0,1)","v":1},{"$f":"AND(AB181=1,AB180=0)","v":false},{"$f":"$AC181*B181","v":0},0,0,0,0,0,0]
[null,34,null,208,null,91.9,null,0.95,null,61,null,null,null,1880,null,400,null,null,5.8,null,null,null,null,null,null,null,null,{"$f":"IF(B182<$AC$1,0,1)","v":1},{"$f":"AND(AB182=1,AB181=0)","v":false},{"$f":"$AC182*B182","v":0},0,0,0,0,0,0]
[null,43,null,208,null,92.7,null,0.93,null,79,null,null,null,2385,null,400,null,null,7.8,null,null,null,null,null,null,null,null,{"$f":"IF(B183<$AC$1,0,1)","v":1},{"$f":"AND(AB183=1,AB182=0)","v":false},{"$f":"$AC183*B183","v":0},0,0,0,0,0,0]
[null,54,null,208,null,93.1,null,0.97,null,93,null,null,null,2967,null,400,null,null,17.100000000000001,null,null,null,null,null,null,null,null,{"$f":"IF(B184<$AC$1,0,1)","v":1},{"$f":"AND(AB184=1,AB183=0)","v":false},{"$f":"$AC184*B184","v":0},0,0,0,0,0,0]
[null,null,null,null,null,null,null,null,null,null,null,null,null,null,null,null,null,null,null,null,null,null,null,null,null,null,null,null,null,{"$f":"SUM(AD180:AD184)","v":16},{"$f":"SUM(AE180:AE184)","v":208},89.1,0.93,31,899,2.2000000000000002]
[null,20,null,264,null,90.1,null,0.9,null,39,null,null,null,869,null,400,null,null,2.2000000000000002,null,null,null,null,null,null,null,null,{"$f":"IF(B186<$AC$1,0,1)","v":1},{"$f":"AND(AB186=1,AB185=0)","v":true},{"$f":"$AC186*B186","v":20},264,90.1,0.9,39,869,2.2000000000000002]
[null,30,null,264,null,91.2,null,0.9,null,57,null,null,null,1307,null,400,null,null,3.9,null,null,null,null,null,null,null,null,{"$f":"IF(B187<$AC$1,0,1)","v":1},{"$f":"AND(AB187=1,AB186=0)","v":false},{"$f":"$AC187*B187","v":0},0,0,0,0,0,0]
[null,45,null,264,null,92.6,null,0.92,null,83,null,null,null,1953,null,400,null,null,5.8,null,null,null,null,null,null,null,null,{"$f":"IF(B188<$AC$1,0,1)","v":1},{"$f":"AND(AB188=1,AB187=0)","v":false},{"$f":"$AC188*B188","v":0},0,0,0,0,0,0]
[null,55,null,264,null,93.2,null,0.95,null,97,null,null,null,2387,null,400,null,null,7.8,null,null,null,null,null,null,null,null,{"$f":"IF(B189<$AC$1,0,1)","v":1},false,{"$f":"$AC189*B189","v":0},0,0,0,0,0,0]
[null,75,null,264,null,93.5,null,0.95,null,137,null,null,null,3254,null,400,null,null,9.8000000000000007,null,null,null,null,null,null,null,null,{"$f":"IF(B190<$AC$1,0,1)","v":1},false,{"$f":"$AC190*B190","v":0},0,0,0,0,0,0]
[null,null,null,null,null,null,null,null,null,null,null,null,null,null,null,null,null,null,null,null,null,null,null,null,null,null,null,null,null,{"$f":"SUM(AD186:AD190)","v":20},{"$f":"SUM(AE186:AE190)","v":264},90.1,0.9,39,869,2.2000000000000002]
[null,25,null,298,null,91.4,null,0.93,null,45,null,null,null,940,null,400,null,null,2.2000000000000002,null,null,null,null,null,null,null,null,{"$f":"IF(B192<$AC$1,0,1)","v":1},true,{"$f":"$AC192*B192","v":25},298,91.4,0.93,45,940,2.2000000000000002]
[null,34,null,298,null,92.7,null,0.95,null,60,null,null,null,1312,null,400,null,null,3.9,null,null,null,null,null,null,null,null,{"$f":"IF(B193<$AC$1,0,1)","v":1},false,{"$f":"$AC193*B193","v":0},0,0,0,0,0,0]
[null,54,null,298,null,93.3,null,0.93,null,97,null,null,null,2079,null,400,null,null,5.8,null,null,null,null,null,null,null,null,{"$f":"IF(B194<$AC$1,0,1)","v":1},false,{"$f":"$AC194*B194","v":0},0,0,0,0,0,0]
[null,68,null,298,null,94,null,0.94,null,119,null,null,null,2599,null,400,null,null,7.8,null,null,null,null,null,null,null,null,{"$f":"IF(B195<$AC$1,0,1)","v":1},false,{"$f":"$AC195*B195","v":0},0,0,0,0,0,0]
[null,null,null,null,null,null,null,null,null,null,null,null,null,null,null,null,null,null,null,null,null,null,null,null,null,null,null,null,null,{"$f":"SUM(AD192:AD195)","v":25},{"$f":"SUM(AE192:AE195)","v":298},91.4,0.93,45,940,2.2000000000000002]
[null,13,null,175,null,87.6,null,0.92,null,22,null,null,null,830,null,460,null,null,2.2000000000000002,null,null,null,null,null,null,null,null,{"$f":"IF(B197<$AC$1,0,1)","v":1},true,{"$f":"$AC197*B197","v":13},175,87.6,0.92,22,830,2.2000000000000002]
[null,19,null,175,null,89.3,null,0.91,null,32,null,null,null,1246,null,460,null,null,3.9,null,null,null,null,null,null,null,null,1,false,0,0,0,0,0,0,0,null,null,null,null,null,null,null,null,null,null,null,null,null,null,null,null,null,null,null,null,null,null,null,null,null,null,null,null,null,null,null,null,null,null,null,null,null,null,"M3VA",63,"B","3GVA",60,"242-封A",null,null,null,null,null,null,null,null,null,null,null,null,null,null,null,null,null,"4.5"]
[null,29,null,175,null,90.8,null,0.93,null,46,null,null,null,1861,null,460,null,null,5.8,null,null,null,null,null,null,null,null,1,false,0,0,0,0,0,0,0,null,null,null,null,null,null,null,null,null,null,null,null,null,null,null,null,null,null,null,null,null,null,null,null,null,null,null,null,null,null,null,null,null,null,null,null,null,null,"M3VA",71,"A","3GVA",70,"241-封B",null,null,null,null,null,null,null,null,null,null,null,null,null,null,null,null,null,"5.5"]
[null,35,null,175,null,91.6,null,0.96,null,54,null,null,null,2275,null,460,null,null,7.8,null,null,null,null,null,null,null,null,1,false,0,0,0,0,0,0,0,null,null,null,null,null,null,null,null,null,null,null,null,null,null,null,null,null,null,null,null,null,null,null,null,null,null,null,null,null,null,null,null,null,null,null,null,null,null,"M3VA",71,"B","3GVA",70,"242-封B",null,null,null,null,null,null,null,null,null,null,null,null,null,null,null,null,null,"6.5"]
[null,47,null,175,null,92,null,0.96,null,73,null,null,null,3086,null,460,null,null,17.100000000000001,null,null,null,null,null,null,null,null,1,false,0,0,0,0,0,0,0,null,null,null,null,null,null,null,null,null,null,null,null,null,null,null,null,null,null,null,null,null,null,null,null,null,null,null,null,null,null,null,null,null,null,null,null,null,null,"M3VA",80,"A","3GVA",80,"241-封B",null,null,null,null,null,null,null,null,null,null,null,null,null,null,null,null,null,9]
[null,63,null,175,null,92.5,null,0.95,null,97,null,null,null,4112,null,460,null,null,22.4,null,null,null,null,null,null,null,null,1,false,0,0,0,0,0,0,0,null,null,null,null,null,null,null,null,null,null,null,null,null,null,null,null,null,null,null,null,null,null,null,null,null,null,null,null,null,null,null,null,null,null,null,null,null,null,"M3VA",80,"B","3GVA",80,"242-封B",null,null,null,null,null,null,null,null,null,null,null,null,null,null,null,null,null,10]
[null,79,null,175,null,93,null,0.98,null,117,null,null,null,5148,null,460,null,null,28.5,null,null,null,null,null,null,null,null,1,false,0,0,0,0,0,0,0,null,null,null,null,null,null,null,null,null,null,null,null,null,null,null,null,null,null,null,null,null,null,null,null,null,null,null,null,null,null,null,null,null,null,null,null,null,null,"M3VA",80,"C","3GVA",80,"243-封B",null,null,null,null,null,null,null,null,null,null,null,null,null,null,null,null,null,"10.5"]
[null,null,null,null,null,null,null,null,null,null,null,null,null,null,null,null,null,null,null,null,null,null,null,null,null,null,null,null,null,{"$f":"SUM(AD197:AD203)","v":13},{"$f":"SUM(AE197:AE203)","v":175},87.6,0.92,22,830,2.2000000000000002,null,null,null,null,null,null,null,null,null,null,null,null,null,null,null,null,null,null,null,null,null,null,null,null,null,null,null,null,null,null,null,null,null,null,null,null,null,null,"M3AA",90,"S","3GAA",98,"113-封E",null,null,null,null,null,null,null,null,null,null,null,null,null,null,null,null,null,13]
[null,19,null,239,null,89.6,null,0.92,null,31,null,null,null,912,null,460,null,null,2.2000000000000002,null,null,null,null,null,null,null,null,{"$f":"IF(B205<$AC$1,0,1)","v":1},true,{"$f":"$AC205*B205","v":19},239,89.6,0.92,31,912,2.2000000000000002,null,null,null,null,null,null,null,null,null,null,null,null,null,null,null,null,null,null,null,null,null,null,null,null,null,null,null,null,null,null,null,null,null,null,null,null,null,null,"M3AA",90,"L","3GAA",98,"114-封E",null,null,null,null,null,null,null,null,null,null,null,null,null,null,null,null,null,16]
[null,28,null,239,null,91,null,0.93,null,46,null,null,null,1364,null,460,null,null,3.9,null,null,null,null,null,null,null,null,1,false,0,0,0,0,0,0,0,null,null,null,null,null,null,null,null,null,null,null,null,null,null,null,null,null,null,null,null,null,null,null,null,null,null,null,null,null,null,null,null,null,null,null,null,null,null,"M3AA",100,"LA","3GAA",108,"112-封E",null,null,null,null,null,null,null,null,null,null,null,null,null,null,null,null,null,20]
[null,40,null,239,null,92.3,null,0.95,null,62,null,null,null,1908,null,460,null,null,5.8,null,null,null,null,null,null,null,null,1,false,0,0,0,0,0,0,0,null,null,null,null,null,null,null,null,null,null,null,null,null,null,null,null,null,null,null,null,null,null,null,null,null,null,null,null,null,null,null,null,null,null,null,null,null,null,"M3AA",100,"LB","3GAA",108,"113-封E",null,null,null,null,null,null,null,null,null,null,null,null,null,null,null,null,null,23]
[null,51,null,239,null,93.2,null,0.92,null,80,null,null,null,2422,null,460,null,null,7.8,null,null,null,null,null,null,null,null,1,false,0,0,0,0,0,0,0,null,null,null,null,null,null,null,null,null,null,null,null,null,null,null,null,null,null,null,null,null,null,null,null,null,null,null,null,null,null,null,null,null,null,null,null,null,null,"M3AA",112,"M","3GAA",118,"103-封C",null,null,null,null,null,null,null,null,null,null,null,null,null,null,null,null,null,32]
[null,63,null,239,null,93.6,null,0.96,null,95,null,null,null,3016,null,460,null,null,17.100000000000001,null,null,null,null,null,null,null,null,1,false,0,0,0,0,0,0,0,null,null,null,null,null,null,null,null,null,null,null,null,null,null,null,null,null,null,null,null,null,null,null,null,null,null,null,null,null,null,null,null,null,null,null,null,null,null,"M3AA",132,"S","3GAA",138,"125-封C",null,null,null,null,null,null,null,null,null,null,null,null,null,null,null,null,null,48]
[null,94,null,239,null,93.9,null,0.96,null,142,null,null,null,4521,null,460,null,null,22.4,null,null,null,null,null,null,null,null,1,false,0,0,0,0,0,0,0,null,null,null,null,null,null,null,null,null,null,null,null,null,null,null,null,null,null,null,null,null,null,null,null,null,null,null,null,null,null,null,null,null,null,null,null,null,null,"M3AA",132,"M","3GAA",138,"126-封C",null,null,null,null,null,null,null,null,null,null,null,null,null,null,null,null,null,59]
[null,null,null,null,null,null,null,null,null,null,null,null,null,null,null,null,null,null,null,null,null,null,null,null,null,null,null,null,null,{"$f":"SUM(AD205:AD210)","v":19},{"$f":"SUM(AE205:AE210)","v":239},89.6,0.92,31,912,2.2000000000000002,null,null,null,null,null,null,null,null,null,null,null,null,null,null,null,null,null,null,null,null,null,null,null,null,null,null,null,null,null,null,null,null,null,null,null,null,null,null,"M3AA",160,"M","3GAA",168,"309-封C",null,null,null,null,null,null,null,null,null,null,null,null,null,null,null,null,null,92]
[null,23,null,304,null,90.8,null,0.89,null,38,null,null,null,857,null,460,null,null,2.2000000000000002,null,null,null,null,null,null,null,null,{"$f":"IF(B212<$AC$1,0,1)","v":1},true,{"$f":"$AC212*B212","v":23},304,90.8,0.89,38,857,2.2000000000000002,null,null,null,null,null,null,null,null,null,null,null,null,null,null,null,null,null,null,null,null,null,null,null,null,null,null,null,null,null,null,null,null,null,null,null,null,null,null,"M3AA",160,"L","3GAA",168,"310-封C",null,null,null,null,null,null,null,null,null,null,null,null,null,null,null,null,null,117]
[null,34,null,304,null,92.2,null,0.89,null,57,null,null,null,1286,null,460,null,null,3.9,null,null,null,null,null,null,null,null,{"$f":"IF(B213<$AC$1,0,1)","v":1},false,{"$f":"$AC213*B213","v":0},0,0,0,0,0,0,null,null,null,null,null,null,null,null,null,null,null,null,null,null,null,null,null,null,null,null,null,null,null,null,null,null,null,null,null,null,null,null,null,null,null,null,null,null,"M3AA",180,"L","3GAA",188,"304-封C",null,null,null,null,null,null,null,null,null,null,null,null,null,null,null,null,null,159]
[null,51,null,304,null,93.2,null,0.91,null,81,null,null,null,1920,null,460,null,null,5.8,null,null,null,null,null,null,null,null,{"$f":"IF(B214<$AC$1,0,1)","v":1},false,{"$f":"$AC214*B214","v":0},0,0,0,0,0,0,null,null,null,null,null,null,null,null,null,null,null,null,null,null,null,null,null,null,null,null,null,null,null,null,null,null,null,null,null,null,null,null,null,null,null,null,null,null,"M3AA",200,"MLA","3GAA",208,"107-封C",null,null,null,null,null,null,null,null,null,null,null,null,null,null,null,null,null,165]
[null,62,null,304,null,93.6,null,0.95,null,94,null,null,null,2338,null,460,null,null,7.8,null,null,null,null,null,null,null,null,{"$f":"IF(B215<$AC$1,0,1)","v":1},false,{"$f":"$AC215*B215","v":0},0,0,0,0,0,0,null,null,null,null,null,null,null,null,null,null,null,null,null,null,null,null,null,null,null,null,null,null,null,null,null,null,null,null,null,null,null,null,null,null,null,null,null,null,"M3AA",200,"MLB","3GAA",208,"108-封C",null,null,null,null,null,null,null,null,null,null,null,null,null,null,null,null,null,185]
[null,84,null,304,null,94,null,0.95,null,128,null,null,null,3171,null,460,null,null,17.100000000000001,null,null,null,null,null,null,null,null,{"$f":"IF(B216<$AC$1,0,1)","v":1},false,{"$f":"$AC216*B216","v":0},0,0,0,0,0,0,null,null,null,null,null,null,null,null,null,null,null,null,null,null,null,null,null,null,null,null,null,null,null,null,null,null,null,null,null,null,null,null,null,null,null,null,null,null,"M3AA",200,"MLC","3GAA",208,"109-封C",null,null,null,null,null,null,null,null,null,null,null,null,null,null,null,null,null,200]
[null,null,null,null,null,null,null,null,null,null,null,null,null,null,null,null,null,null,null,null,null,null,null,null,null,null,null,null,null,{"$f":"SUM(AD212:AD216)","v":23},{"$f":"SUM(AE212:AE216)","v":304},90.8,0.89,38,857,2.2000000000000002,null,null,null,null,null,null,null,null,null,null,null,null,null,null,null,null,null,null,null,null,null,null,null,null,null,null,null,null,null,null,null,null,null,null,null,null,null,null,"M3AA",225,"SMB","3GAA",228,"105-封C",null,null,null,null,null,null,null,null,null,null,null,null,null,null,null,null,null,225]
[null,null,null,null,null,null,null,null,null,null,null,null,null,null,null,null,null,null,null,null,null,null,null,null,null,null,null,null,null,null,null,null,null,null,null,null,null,null,null,null,null,null,null,null,null,null,null,null,null,null,null,null,null,null,null,null,null,null,null,null,null,null,null,null,null,null,null,null,null,null,null,null,null,null,"M3AA",225,"SMC","3GAA",228,"106-封C",null,null,null,null,null,null,null,null,null,null,null,null,null,null,null,null,null,250]
[null,null,null,null,null,null,null,null,null,null,null,null,null,null,null,null,null,null,null,null,null,null,null,null,null,null,null,null,null,null,null,null,null,null,null,null,null,null,null,null,null,null,null,null,null,null,null,null,null,null,null,null,null,null,null,null,null,null,null,null,null,null,null,null,null,null,null,null,null,null,null,null,null,null,"M3AA",250,"SMB","3GAA",258,"103-封C",null,null,null,null,null,null,null,null,null,null,null,null,null,null,null,null,null,320]